{"text_format":"1","workbook":"xlsx","n_sheets":7,"sheets":["Case 1","Case 2","Case 4","Case 5","Tutorial 4","Case 6","Case 7"],"not_rendered":{"charts":2,"images":0,"macros":1,"external_links":0,"defined_names":0,"comments":0,"pivot_tables":0},"unopened":[],"bounds":{"document_bytes":16777216,"sheet_cells":100000,"rows_first":2000,"rows_last":500,"rows_between":2000,"halvings":0,"cell_chars":16384,"cell_head_chars":4096},"cells_cut":0,"cells_raw":0,"read":"whole","date_system":"1900"}

{"sheet":"Case 1","index":0,"n_rows":6,"n_cols":6,"rows_kept":6,"cut":false,"hidden":false,"merged":[]}
[null,1,2,3,4,5]
[1,{"$f":"$A2*B$1","v":1},{"$f":"$A2*C$1","v":2},3,4,5]
[2,{"$f":"$A3*B$1","v":2},4,6,8,10]
[3,3,6,9,12,15]
[4,4,8,12,16,20]
[5,5,10,15,20,25]

{"sheet":"Case 2","index":1,"n_rows":40,"n_cols":11,"rows_kept":40,"cut":false,"hidden":false,"merged":[]}
[null,56,37,54,46,29,28,78,59,73,61]
[null,44,80,32,47,47,26,37,67,55,84]
[null,58,60,54,56,38,62,84,79,19,69]
[null,66,39,36,74,17,30,85,27,37,37]
[null,80,96,54,60,75,67,83,48,55,12]
[null,61,56,89,58,52,72,35,45,13,64]
[null,34,59,27,15,79,62,81,44,78,78]
[null,67,46,38,76,54,31,90,35,54,38]
[null,65,55,45,44,63,55,52,66,41,31]
[null,78,20,55,6,31,27,49,29,29,79]
[null,24,43,29,78,61,83,81,81,40,65]
[null,76,58,38,91,20,39,44,43,70,88]
[null,30,79,71,71,23,36,79,78,51,56]
[null,33,19,25,60,29,55,93,65,50,41]
[null,90,22,40,66,51,24,49,75,52,63]
[null,71,61,31,62,64,18,89,35,28,25]
[null,43,29,70,32,35,44,17,62,47,21]
[null,36,55,39,50,61,51,61,87,46,81]
[null,48,37,51,11,50,42,78,59,50,51]
[null,70,49,54,48,37,3,58,80,68,66]
[]
["Percentile"]
[0,{"$f":"PERCENTILE(B$1:B$20,$A23/100)","v":24},{"$f":"PERCENTILE(C$1:C$20,$A23/100)","v":19},25,6,17,3,17,27,13,12]
[20,{"$f":"PERCENTILE(B$1:B$20,$A24/100)","v":35.6},35.400000000000006,31.8,41.600000000000009,29,26.8,48,41.400000000000006,35.400000000000006,35.800000000000004]
[35,46.599999999999994,41.599999999999994,38,47.65,36.299999999999997,30.65,55.9,46.949999999999996,44.25,47.499999999999993]
[40,52.800000000000011,44.800000000000004,38.6,49.2,37.6,34.000000000000007,59.800000000000004,54.600000000000016,46.6,54.000000000000007]
[45,57.1,47.650000000000006,39.549999999999997,53.300000000000004,42.95,37.650000000000006,70.350000000000009,59,48.650000000000006,58.75]
[50,59.5,52,42.5,57,48.5,40.5,78,60.5,50,62]
[95,80.5,80.800000000000011,71.900000000000006,78.650000000000006,75.2,72.550000000000011,90.15,81.300000000000011,73.25,84.2]
[]
["Percentile Rank"]
[0,{"$f":"IFERROR(PERCENTRANK(B$1:B$20,$A32),\"Out of Range\")","v":"Out of Range"},{"$f":"IFERROR(PERCENTRANK(C$1:C$20,$A32),\"Out of Range\")","v":"Out of Range"},"Out of Range","Out of Range","Out of Range","Out of Range","Out of Range","Out of Range","Out of Range","Out of Range"]
[8,{"$f":"IFERROR(PERCENTRANK(B$1:B$20,$A33),\"Out of Range\")","v":"Out of Range"},"Out of Range","Out of Range",2.1000000000000001E-2,"Out of Range",1.7000000000000001E-2,"Out of Range","Out of Range","Out of Range","Out of Range"]
[12,"Out of Range","Out of Range","Out of Range",6.5000000000000002E-2,"Out of Range",3.1E-2,"Out of Range","Out of Range","Out of Range",0]
[67,0.68400000000000005,0.85899999999999999,0.88400000000000001,0.747,0.90900000000000003,0.89400000000000002,0.439,0.68400000000000005,0.83799999999999997,0.70099999999999996]
[90,1,0.98,"Out of Range",0.995,"Out of Range","Out of Range",0.94699999999999995,"Out of Range","Out of Range","Out of Range"]
[104,"Out of Range","Out of Range","Out of Range","Out of Range","Out of Range","Out of Range","Out of Range","Out of Range","Out of Range","Out of Range"]
[]
[null,{"$f":"IF(SUM(B1:B20)<1000,\"< 1000\",SUM(B1:B20))","v":1130},{"$f":"IF(SUM(C1:C20)<1000,\"< 1000\",SUM(C1:C20))","v":1000},"< 1000",{"$f":"IF(SUM(E1:E20)<1000,\"< 1000\",SUM(E1:E20))","v":1051},"< 1000","< 1000",1323,1164,"< 1000",1110]
[null,{"$f":"SUMIF(B1:B20, \">70\")","v":395},{"$f":"SUMIF(C1:C20, \">70\")","v":255},160,390,154,155,921,480,151,410]

{"sheet":"Case 4","index":2,"n_rows":8,"n_cols":9,"rows_kept":8,"cut":false,"hidden":false,"merged":[]}
["Assignment","Weight","Points","Total","Grade %",null,null,"Sum:",{"$f":"SUMPRODUCT(B2:B8,E2:E8)","v":0.56074999999999997}]
["HW 1",0.1,18,20,{"$f":"IF(ISBLANK(C2),\"\",C2/D2)","v":0.9},null,null,"Normalized Sum:",0.86269230769230765]
["Quiz 1",0.15,null,10,{"$f":"IF(ISBLANK(C3),\"\",C3/D3)","v":""}]
["HW 2",0.1,43,50,0.86]
["Quiz 2",0.15,23,24,0.95833333333333337]
["Test 1",0.2,null,50,""]
["HW 3",0.1,9,20,0.45]
["Test 2",0.2,49,50,0.98]

{"sheet":"Case 5","index":3,"n_rows":31,"n_cols":5,"rows_kept":31,"cut":false,"hidden":false,"merged":[]}
["Date","Close"]
["2012-07-13",1356.78,{"$f":"IF(B2>B3,1,0)","v":1},null,{"$f":"SUM(C2:C30)/COUNT(C2:C30)","v":0.55172413793103448}]
["2012-07-12",1334.76,{"$f":"IF(B3>B4,1,0)","v":0}]
["2012-07-11",1341.45,0]
["2012-07-10",1341.47,0]
["2012-07-09",1352.46,0]
["2012-07-06",1354.68,0]
["2012-07-05",1367.58,0]
["2012-07-03",1374.02,1]
["2012-07-02",1365.51,1]
["2012-06-29",1362.16,1]
["2012-06-28",1329.04,0]
["2012-06-27",1331.85,1]
["2012-06-26",1319.99,1]
["2012-06-25",1313.72,0]
["2012-06-22",1335.02,1]
["2012-06-21",1325.51,0]
["2012-06-20",1355.69,0]
["2012-06-19",1357.98,1]
["2012-06-18",1344.78,1]
["2012-06-15",1342.84,1]
["2012-06-14",1329.1,1]
["2012-06-13",1314.88,0]
["2012-06-12",1324.18,1]
["2012-06-11",1308.93,0]
["2012-06-08",1325.66,1]
["2012-06-07",1314.99,0]
["2012-06-06",1315.13,1]
["2012-06-05",1285.5,1]
["2012-06-04",1278.18,1]
["2012-06-01",1278.04]

{"sheet":"Tutorial 4","index":4,"n_rows":20,"n_cols":2,"rows_kept":20,"cut":false,"hidden":false,"merged":[]}
[13,9.0210121953835376E-2]
[8,0.20561089737906824]
[17,0.26673127257153539]
[7,0.27911771688725739]
[15,0.28417672112017112]
[20,0.35967222868255977]
[1,0.49213431683987974]
[9,0.50077735060097006]
[3,0.50869542540721113]
[18,0.55494422116479747]
[14,0.6385269808925651]
[4,0.79469339374601033]
[2,0.80425915007152438]
[10,0.83959065536785626]
[5,0.86674280872644549]
[16,0.88285002011241454]
[19,0.88776489943286552]
[6,0.92745588588425498]
[12,0.92954063888222116]
[11,0.94834343775395702]

{"sheet":"Case 6","index":5,"n_rows":31,"n_cols":14,"rows_kept":31,"cut":false,"hidden":false,"merged":[]}
["Date ","Open ","High ","Low ","Close ","Volume",null,null,"Date ","Open ","High ","Low ","Close ","Volume"]
["2012-07-27",1360.05,1389.19,1360.05,1385.97,740576248,null,null,"2012-07-20",{"$f":"IFERROR(VLOOKUP($I2,$A$1:$F$31,COLUMN()-8,FALSE),\"***NO DATA***\")","v":1376.51},{"$f":"IFERROR(VLOOKUP($I2,$A$1:$F$31,COLUMN()-8,FALSE),\"***NO DATA***\")","v":1376.51},1362.19,1362.66,851766884]
["2012-07-26",1338.17,1363.13,1338.17,1360.02,705312389,null,null,"2012-07-18",{"$f":"IFERROR(VLOOKUP($I3,$A$1:$F$31,COLUMN()-8,FALSE),\"***NO DATA***\")","v":1363.58},1375.26,1358.96,1372.78,573272738]
["2012-07-25",1338.35,1343.98,1331.5,1337.89,643149202,null,null,"2012-06-25",1334.9,1334.9,1309.27,1313.72,596638856]
["2012-07-24",1350.52,1351.53,1329.24,1338.31,616405681,null,null,"2012-06-24","***NO DATA***","***NO DATA***","***NO DATA***","***NO DATA***","***NO DATA***"]
["2012-07-23",1362.34,1362.34,1337.56,1350.52,591487647,null,null,"2012-06-18",1342.42,1348.22,1334.46,1344.78,540693645]
["2012-07-20",1376.51,1376.51,1362.19,1362.66,851766884]
["2012-07-19",1373.01,1380.39,1371.21,1376.51,631244869]
["2012-07-18",1363.58,1375.26,1358.96,1372.78,573272738]
["2012-07-17",1353.68,1365.36,1345.07,1363.67,554028066]
["2012-07-16",1356.5,1357.26,1348.51,1353.64,460442491]
["2012-07-13",1334.81,1357.7,1334.81,1356.78,522326756]
["2012-07-12",1341.29,1341.29,1325.41,1334.76,597864299]
["2012-07-11",1341.4,1345,1333.25,1341.45,593546769]
["2012-07-10",1352.96,1361.54,1336.27,1341.47,557227621]
["2012-07-09",1354.66,1354.87,1346.65,1352.46,488550379]
["2012-07-06",1367.09,1367.09,1348.03,1354.68,473892776]
["2012-07-05",1373.72,1373.85,1363.02,1367.58,491316624]
["2012-07-03",1365.75,1374.81,1363.53,1374.02,333805962]
["2012-07-02",1362.33,1366.35,1355.7,1365.51,544915121]
["2012-06-29",1330.12,1362.17,1330.12,1362.16,852335491]
["2012-06-28",1331.52,1331.52,1313.29,1329.04,692430228]
["2012-06-27",1320.71,1334.4,1320.71,1331.85,499592326]
["2012-06-26",1314.09,1324.24,1310.3,1319.99,550335831]
["2012-06-25",1334.9,1334.9,1309.27,1313.72,596638856]
["2012-06-22",1325.92,1337.82,1325.92,1335.02,929041316]
["2012-06-21",1355.43,1358.27,1324.41,1325.51,677891678]
["2012-06-20",1358.04,1361.57,1346.45,1355.69,573023007]
["2012-06-19",1344.83,1363.46,1344.83,1357.98,586629773]
["2012-06-18",1342.42,1348.22,1334.46,1344.78,540693645]
["2012-06-15",1329.19,1343.32,1329.19,1342.84,1141818297]

{"sheet":"Case 7","index":6,"n_rows":423,"n_cols":28,"rows_kept":423,"cut":false,"hidden":false,"merged":[]}
[null,"Station (alphabetical by borough)",null,null,null,null,null,null,null,null,null,null,null,null,null,null,null,null,null,null,"Value","Station",null,"The Bronx","161 St-Yankee Stadium [B, D, 4]",null,"The Bronx",{"$f":"COUNTIF(X:X,AA1)","v":2}]
[null,null,2007,2008,2009,2010,2011,"2010-11 Change ",null,"2011 Rank",null,"Decreasing","Increasing",null,null,"% Increasing",null,"% Change",null,"Max",{"$f":"MAX(R3:R423)","v":1.0349416889499516},{"$f":"OFFSET($R$2,MATCH(U2,$R$3:$R$423,0),-16)","v":"Kingsbridge Rd [4]"},null,"The Bronx","3 Av-149 St [2, 5]",null,"Brooklyn",{"$f":"COUNTIF(X:X,AA2)","v":10}]
["The Bronx","138 St-Grand Concourse [4, 5]",800595,864369,887662,898509,917911,19402,2.1999999999999999E-2,361,null,{"$f":"IF(AND(G3<F3,F3<E3,E3<D3,D3<C3),\"YES\",\"NO\")","v":"NO"},{"$f":"IF(AND(G3>F3,F3>E3,E3>D3,D3>C3),\"YES\",\"NO\")","v":"YES"},null,{"$f":"A3","v":"The Bronx"},{"$f":"COUNTIF(M3:M70,\"=YES\")/COUNTA(M3:M70)","v":0.22058823529411764},null,{"$f":"IFERROR((G3-C3)/C3,\"\")","v":0.14653601383970671},null,"Min",{"$f":"MIN(R3:R423)","v":-0.63924612771779898},{"$f":"OFFSET($R$2,MATCH(U3,$R$3:$R$423,0),-16)","v":"Elder Av [6]"},null,"Brooklyn","Atlantic Av [B, Q, 2, 3, 4, 5, D, N, R]",null,"Manhattan",{"$f":"COUNTIF(X:X,AA3)","v":50}]
["The Bronx","149 St-Grand Concourse [2, 4, 5]",3112547,3454530,3660150,3979328,4169699,190371,4.8000000000000001E-2,110,null,{"$f":"IF(AND(G4<F4,F4<E4,E4<D4,D4<C4),\"YES\",\"NO\")","v":"NO"},{"$f":"IF(AND(G4>F4,F4>E4,E4>D4,D4>C4),\"YES\",\"NO\")","v":"YES"},null,{"$f":"A71","v":"Brooklyn"},{"$f":"COUNTIF(M71:M227,\"=YES\")/COUNTA(M71:M227)","v":0.22292993630573249},null,{"$f":"IFERROR((G4-C4)/C4,\"\")","v":0.3396421001835474},null,null,null,null,null,"Brooklyn","Bedford Av [L]",null,"Queens",{"$f":"COUNTIF(X:X,AA4)","v":16}]
["The Bronx","161 St-Yankee Stadium [B, D, 4]",7836990,8576546,8410256,8434247,8605893,171646,0.02,36,null,"NO","NO",null,{"$f":"A228","v":"Manhattan"},{"$f":"COUNTIF(M228:M345,\"=YES\")/COUNTA(M228:M345)","v":0.11016949152542373},null,9.8112030256514299E-2,null,null,null,null,null,"Brooklyn","Court St [R, 2, 3, 4, 5]"]
["The Bronx","167 St [4]",2715327,2876058,2892398,2931947,2978748,46801,1.6E-2,160,null,"NO","YES",null,{"$f":"A346","v":"Queens"},{"$f":"COUNTIF(M346:M423,\"=YES\")/COUNTA(M346:M423)","v":7.6923076923076927E-2},null,9.7012624998757055E-2,null,null,null,null,null,"Brooklyn","Crown Heights-Utica Av [3, 4]"]
["The Bronx","167 St [B, D]",2834640,2920517,2874428,2907900,2952368,44468,1.4999999999999999E-2,166,null,"NO","NO",null,null,null,null,4.1531905286032796E-2,null,null,null,null,null,"Brooklyn","DeKalb Av [B, Q, R]"]
["The Bronx","170 St [4]",2523549,2735272,2831174,2950997,2954573,3576,1E-3,164,null,"NO","YES",null,null,null,null,0.17080072548621009,null,null,null,null,null,"Brooklyn","Flatbush Av-Brooklyn College [2, 5]"]
["The Bronx","170 St [B, D]",2019834,2092449,2014364,1940700,1988409,47709,2.5000000000000001E-2,232,null,"NO","NO",null,null,null,null,-1.5558209238977064E-2,null,null,null,null,null,"Brooklyn","Jay St-MetroTech [A, C, F, R]"]
["The Bronx","174 St [2, 5]",2047981,2159617,2127174,2239254,2161875,-77379,-3.5000000000000003E-2,213,null,"NO","NO",null,null,null,null,5.5612820626753864E-2,null,null,null,null,null,"Brooklyn","Kings Hwy [B, Q]"]
["The Bronx","174-175 Sts [B, D]",1490168,1557954,1475159,1451367,1492092,40725,2.8000000000000001E-2,288,null,"NO","NO",null,null,null,null,1.2911295907575523E-3,null,null,null,null,null,"Brooklyn","Myrtle-Wyckoff Avs [L, M]"]
["The Bronx","176 St [4]",1454231,1604117,1378480,1445219,1720629,275410,0.191,263,null,"NO","NO",null,null,null,null,0.18318822800504184,null,null,null,null,null,"Brooklyn","Nostrand Av [A, C]"]
["The Bronx","182-183 Sts [B, D]",1592710,1561529,1506398,1495831,1489026,-6805,-5.0000000000000001E-3,289,null,"YES","NO",null,null,null,null,-6.5099107809959131E-2,null,null,null,null,null,"Manhattan","1 Av [L]"]
["The Bronx","183 St [4]",1073820,1864350,1913656,1945021,1978737,33716,1.7000000000000001E-2,234,null,"NO","YES",null,null,null,null,0.84270827512991009,null,null,null,null,null,"Manhattan","116 St [6]"]
["The Bronx","219 St [2, 5]",854553,926893,957529,1024424,1032343,7919,8.0000000000000002E-3,350,null,"NO","YES",null,null,null,null,0.20805029061977431,null,null,null,null,null,"Manhattan","125 St [4, 5, 6]"]
["The Bronx","225 St [2, 5]",1095409,1173697,1191808,1283398,1336790,53392,4.2000000000000003E-2,306,null,"NO","YES",null,null,null,null,0.22035696255919021,null,null,null,null,null,"Manhattan","125 St [A, B, C, D]"]
["The Bronx","231 St [1]",2531151,2752351,2669185,2660882,2731068,70186,2.5999999999999999E-2,175,null,"NO","NO",null,null,null,null,7.8982644654546491E-2,null,null,null,null,null,"Manhattan","14 St [A, C, E, L]"]
["The Bronx","233 St [2, 5]",1375404,1485276,1508683,1614436,1655372,40936,2.5000000000000001E-2,267,null,"NO","YES",null,null,null,null,0.20355328325350225,null,null,null,null,null,"Manhattan","14 St [F, M, 1, 2, 3, L]"]
["The Bronx","238 St [1]",1097387,1164038,1094292,1067352,902601,-164751,-0.154,362,null,"NO","NO",null,null,null,null,-0.17749982458330563,null,null,null,null,null,"Manhattan","145 St [A, B, C, D]"]
["The Bronx","3 Av-138 St [6]",2023274,2159647,2222695,2190627,2280268,89641,4.1000000000000002E-2,202,null,"NO","NO",null,null,null,null,0.12701888127856137,null,null,null,null,null,"Manhattan","168 St [A, C, 1]"]
["The Bronx","3 Av-149 St [2, 5]",7095262,7393330,7411343,7239167,7232070,-7097,-1E-3,50,null,"NO","NO",null,null,null,null,1.9281599467362867E-2,null,null,null,null,null,"Manhattan","2 Av [F]"]
["The Bronx","Allerton Av [2, 5]",1574252,1625023,1661132,1668896,1602390,-66506,-0.04,275,null,"NO","NO",null,null,null,null,1.7873885502448148E-2,null,null,null,null,null,"Manhattan","23 St [6]"]
["The Bronx","Baychester Av [5]",1112821,1168224,1045547,1087618,1106959,19341,1.7999999999999999E-2,337,null,"NO","NO",null,null,null,null,-5.2676935464014427E-3,null,null,null,null,null,"Manhattan","23 St [C, E]"]
["The Bronx","Bedford Park Blvd [B, D]",1928566,1989894,1932709,1885231,1914096,28865,1.4999999999999999E-2,243,null,"NO","NO",null,null,null,null,-7.5029840824737135E-3,null,null,null,null,null,"Manhattan","23 St [F, M]"]
["The Bronx","Bedford Park Blvd-Lehman College [4]",1614531,1719816,1735029,1786305,1835965,49660,2.8000000000000001E-2,246,null,"NO","YES",null,null,null,null,0.13715066480606442,null,null,null,null,null,"Manhattan","23 St [N, R]"]
["The Bronx","Bronx Park East [2, 5]",856682,880102,865492,888162,826356,-61806,-7.0000000000000007E-2,373,null,"NO","NO",null,null,null,null,-3.5399366392663792E-2,null,null,null,null,null,"Manhattan","28 St [6]"]
["The Bronx","Brook Av [6]",1825026,1915123,1800008,1902909,1950893,47984,2.5000000000000001E-2,237,null,"NO","NO",null,null,null,null,6.896723663114937E-2,null,null,null,null,null,"Manhattan","33 St [6]"]
["The Bronx","Buhre Av [6]",824727,888854,883232,895193,991171,95978,0.107,355,null,"NO","NO",null,null,null,null,0.20181708613880714,null,null,null,null,null,"Manhattan","42 St-Bryant Pk [B, D, F, M, 7]"]
["The Bronx","Burke Av [2, 5]",1019924,1047965,1047238,1060008,1036169,-23839,-2.1999999999999999E-2,348,null,"NO","NO",null,null,null,null,1.5927657354861735E-2,null,null,null,null,null,"Manhattan","47-50 Sts-Rockefeller Center [B, D, F, M]"]
["The Bronx","Burnside Av [4]",3182286,3241959,3408080,3533604,3528312,-5292,-1E-3,132,null,"NO","NO",null,null,null,null,0.10873504141362531,null,null,null,null,null,"Manhattan","49 St [N, Q, R]"]
["The Bronx","Castle Hill Av [6]",2021224,2155897,2036025,2345255,2341370,-3885,-2E-3,197,null,"NO","NO",null,null,null,null,0.15839214258291015,null,null,null,null,null,"Manhattan","5 Av-53 St [E, M]"]
["The Bronx","Cypress Av [6]",1037151,1136278,1082788,1158742,1142381,-16361,-1.4E-2,330,null,"NO","NO",null,null,null,null,0.10146063591511748,null,null,null,null,null,"Manhattan","5 Av-59 St [N, Q, R]"]
["The Bronx","East 143 St-St Mary's St [6]",271886,264788,239458,256277,280840,24563,9.6000000000000002E-2,414,null,"NO","NO",null,null,null,null,3.2932920415174004E-2,null,null,null,null,null,"Manhattan","50 St [1]"]
["The Bronx","East 149 St [6]",1337401,1393227,1335234,1351873,1383455,31582,2.3E-2,300,null,"NO","NO",null,null,null,null,3.4435446062923536E-2,null,null,null,null,null,"Manhattan","50 St [C, E]"]
["The Bronx","East 180 St [2, 5]",1824605,2041507,2049824,1852836,2164608,311772,0.16800000000000001,212,null,"NO","NO",null,null,null,null,0.18634334554602228,null,null,null,null,null,"Manhattan","57 St-7 Av [N, Q, R]"]
["The Bronx","Eastchester-Dyre Av [5]",1146326,1251842,1186603,1258858,1309695,50837,0.04,309,null,"NO","NO",null,null,null,null,0.1425153054192263,null,null,null,null,null,"Manhattan","66 St-Lincoln Center [1]"]
["The Bronx","Elder Av [6]",1999596,2077064,2050983,2864031,721362,-2142669,-0.748,387,null,"NO","NO",null,null,null,null,-0.63924612771779898,null,null,null,null,null,"Manhattan","68 St-Hunter College [6]"]
["The Bronx","Fordham Rd [4]",3954572,3643168,3760364,3866249,3966339,100090,2.5999999999999999E-2,118,null,"NO","NO",null,null,null,null,2.9755432446292546E-3,null,null,null,null,null,"Manhattan","72 St [1, 2, 3]"]
["The Bronx","Fordham Rd [B, D]",3711150,3753128,3656618,3681362,3680312,-1050,0,127,null,"NO","NO",null,null,null,null,-8.3095536424019501E-3,null,null,null,null,null,"Manhattan","77 St [6]"]
["The Bronx","Freeman St [2, 5]",1043539,1150491,1204838,1332285,1348014,15729,1.2E-2,304,null,"NO","YES",null,null,null,null,0.29177155813055383,null,null,null,null,null,"Manhattan","79 St [1]"]
["The Bronx","Gun Hill Rd [2, 5]",1739590,1864323,1928697,2101823,2176939,75116,3.5999999999999997E-2,209,null,"NO","YES",null,null,null,null,0.2514092401083014,null,null,null,null,null,"Manhattan","8 St-New York University [N, R]"]
["The Bronx","Gun Hill Rd [5]",1753569,1817798,1675952,1713288,1683011,-30277,-1.7999999999999999E-2,264,null,"NO","NO",null,null,null,null,-4.0236797069291258E-2,null,null,null,null,null,"Manhattan","86 St [1]"]
["The Bronx","Hunts Point Av [6]",3132363,3255048,3244240,3248970,3191706,-57264,-1.7999999999999999E-2,147,null,"NO","NO",null,null,null,null,1.8945122260734148E-2,null,null,null,null,null,"Manhattan","86 St [4, 5, 6]"]
["The Bronx","Intervale Av [2, 5]",826760,870362,870466,908596,902216,-6380,-7.0000000000000001E-3,363,null,"NO","NO",null,null,null,null,9.12671150031448E-2,null,null,null,null,null,"Manhattan","96 St [1, 2, 3]"]
["The Bronx","Jackson Av [2, 5]",1527291,1600588,1558808,1624212,1573302,-50910,-3.1E-2,280,null,"NO","NO",null,null,null,null,3.0125889565249843E-2,null,null,null,null,null,"Manhattan","96 St [6]"]
["The Bronx","Kingsbridge Rd [4]",1557595,2754063,2892922,3037572,3169615,132043,4.2999999999999997E-2,150,null,"NO","YES",null,null,null,null,1.0349416889499516,null,null,null,null,null,"Manhattan","Astor Place [6]"]
["The Bronx","Kingsbridge Rd [B, D]",2677855,2475092,2337672,2285401,2275576,-9825,-4.0000000000000001E-3,203,null,"YES","NO",null,null,null,null,-0.15022434000347293,null,null,null,null,null,"Manhattan","Bowling Green [4, 5]"]
["The Bronx","Longwood Av [6]",1031697,1042782,982290,1026772,1067960,41188,0.04,344,null,"NO","NO",null,null,null,null,3.5148885767817488E-2,null,null,null,null,null,"Manhattan","Broadway-Lafayette St [B, D, F, M, 6]"]
["The Bronx","Middletown Rd [6]",487759,526567,523950,546692,559746,13054,2.4E-2,398,null,"NO","NO",null,null,null,null,0.14758723057903597,null,null,null,null,null,"Manhattan","Brooklyn Bridge-City Hall [4, 5, 6, J, Z]"]
["The Bronx","Morris Park [5]",550547,570262,524382,535823,554320,18497,3.5000000000000003E-2,400,null,"NO","NO",null,null,null,null,6.8531841968079016E-3,null,null,null,null,null,"Manhattan","Canal St [A, C, E]"]
["The Bronx","Morrison Av-Soundview [6]",1879569,2025425,1982168,730517,3028145,2297628,3.145,158,null,"NO","NO",null,null,null,null,0.61108477528624916,null,null,null,null,null,"Manhattan","Canal St [J, N, Q, R, Z, 6]"]
["The Bronx","Mosholu Pkwy [4]",2155241,2539286,2794992,2913786,2961522,47736,1.6E-2,163,null,"NO","YES",null,null,null,null,0.37410247856272222,null,null,null,null,null,"Manhattan","Chambers St [1, 2, 3]"]
["The Bronx","Mt Eden Av [4]",1538588,1607256,1766092,1843698,1814951,-28747,-1.6E-2,250,null,"NO","NO",null,null,null,null,0.17962118513858161,null,null,null,null,null,"Manhattan","Chambers St [A, C, E, 2, 3]"]
["The Bronx","Nereid Av [2, 5]",857763,929559,924584,1001851,1025004,23153,2.3E-2,351,null,"NO","NO",null,null,null,null,0.19497343671853415,null,null,null,null,null,"Manhattan","Delancey St [F, J, M, Z]"]
["The Bronx","Norwood-205 St [D]",2382795,2493009,2308963,2410949,2472094,61145,2.5000000000000001E-2,187,null,"NO","NO",null,null,null,null,3.747657687715477E-2,null,null,null,null,null,"Manhattan","Fulton St [A, C, J, Z, 2, 3, 4, 5]"]
["The Bronx","Parkchester [6]",4605514,4720570,4691478,3944729,4851182,906453,0.23,91,null,"NO","NO",null,null,null,null,5.3342145958084154E-2,null,null,null,null,null,"Manhattan","Grand St [B, D]"]
["The Bronx","Pelham Bay Park [6]",1836334,1931973,1946139,1997392,2062525,65133,3.3000000000000002E-2,225,null,"NO","YES",null,null,null,null,0.12317530471036314,null,null,null,null,null,"Manhattan","Lexington Av-53 St [E, M, 6]"]
["The Bronx","Pelham Pkwy [2, 5]",2313926,2514944,2585393,2703568,2701431,-2137,-1E-3,178,null,"NO","NO",null,null,null,null,0.16746646176238997,null,null,null,null,null,"Manhattan","Prince St [N, R]"]
["The Bronx","Pelham Pkwy [5]",840151,870544,832968,883490,897433,13943,1.6E-2,366,null,"NO","NO",null,null,null,null,6.8180600868177274E-2,null,null,null,null,null,"Manhattan","South Ferry[1, R]"]
["The Bronx","Prospect Av [2, 5]",2208977,2335593,2282752,2326054,2209945,-116109,-0.05,207,null,"NO","NO",null,null,null,null,4.3821189627596846E-4,null,null,null,null,null,"Manhattan","Wall St [2, 3]"]
["The Bronx","Simpson St [2, 5]",2816132,2974529,2874093,3057192,2901513,-155679,-5.0999999999999997E-2,167,null,"NO","NO",null,null,null,null,3.0318536204979027E-2,null,null,null,null,null,"Manhattan","Wall St [4, 5]"]
["The Bronx","St Lawrence Av [6]",1212190,1297041,1284770,1655340,463809,-1191531,-0.72,406,null,"NO","NO",null,null,null,null,-0.61737928872536485,null,null,null,null,null,"Manhattan","West 4 St-Washington Sq [A, B, C, D, E, F, M]"]
["The Bronx","Tremont Av [B, D]",2769024,2811145,2702043,2709632,2772602,62970,2.3E-2,174,null,"NO","NO",null,null,null,null,1.2921520362409282E-3,null,null,null,null,null,"Queens","103 St-Corona Plaza [7]"]
["The Bronx","Van Cortlandt Park-242 St [1]",1829242,1974147,1925846,1878788,1937333,58545,3.1E-2,239,null,"NO","NO",null,null,null,null,5.9090595995499776E-2,null,null,null,null,null,"Queens","74-Bway [7, E, F, M, R]"]
["The Bronx","Wakefield-241 St [2]",1272043,1344876,1340643,1471501,1560698,89197,6.0999999999999999E-2,282,null,"NO","NO",null,null,null,null,0.22692236032901403,null,null,null,null,null,"Queens","82 St-Jackson Hts [7]"]
["The Bronx","West Farms Sq-East Tremont Av [2, 5]",2266956,2366256,2314557,2520377,2391352,-129025,-5.0999999999999997E-2,193,null,"NO","NO",null,null,null,null,5.4873583783717018E-2,null,null,null,null,null,"Queens","90 St-Elmhurst Av [7]"]
["The Bronx","Westchester Sq-East Tremont Av [6]",1791258,1883509,1828155,1885522,1993343,107821,5.7000000000000002E-2,231,null,"NO","NO",null,null,null,null,0.1128173607598682,null,null,null,null,null,"Queens","Astoria-Ditmars Blvd [N, Q]"]
["The Bronx","Whitlock Av [6]",459855,475282,480146,163461,726747,563286,3.4460000000000002,386,null,{"$f":"IF(AND(G68<F68,F68<E68,E68<D68,D68<C68),\"YES\",\"NO\")","v":"NO"},{"$f":"IF(AND(G68>F68,F68>E68,E68>D68,D68>C68),\"YES\",\"NO\")","v":"NO"},null,null,null,null,{"$f":"IFERROR((G68-C68)/C68,\"\")","v":0.58038294679844737},null,null,null,null,null,"Queens","Court Sq [E, G, M, 7]"]
["The Bronx","Woodlawn [4]",1963703,2051564,2194906,2379276,2494092,114816,4.8000000000000001E-2,185,null,"NO","YES",null,null,null,null,0.27009634348982509,null,null,null,null,null,"Queens","Flushing-Main St [7]"]
["The Bronx","Zerega Av [6]",688598,736708,713198,759280,825755,66475,8.7999999999999995E-2,374,null,"NO","NO",null,null,null,null,0.1991829775863421,null,null,null,null,null,"Queens","Forest Hills-71 Av [E, F, M, R]"]
["Brooklyn","15 St-Prospect Park [F, G]",1848820,1849326,1844403,1922348,1449241,-473107,-0.246,296,null,"NO","NO",null,null,null,null,-0.21612650230958125,null,null,null,null,null,"Queens","Grand Av-Newtown [M, R]"]
["Brooklyn","18 Av [D]",1653638,1792316,1740190,1752952,1654305,-98647,-5.6000000000000001E-2,269,null,"NO","NO",null,null,null,null,4.0335309178913403E-4,null,null,null,null,null,"Queens","Jamaica Center-Parsons-Archer [E, J, Z]"]
["Brooklyn","18 Av [F]",1288783,1311236,1258172,1287551,1306839,19288,1.4999999999999999E-2,311,null,"NO","NO",null,null,null,null,1.4010116520779681E-2,null,null,null,null,null,"Queens","Jamaica-179 St [F]"]
["Brooklyn","18 Av [N]",1451716,1614019,1717106,1676056,1828462,152406,9.0999999999999998E-2,247,null,"NO","NO",null,null,null,null,0.25951770180944483,null,null,null,null,null,"Queens","Junction Blvd [7]"]
["Brooklyn","20 Av [D]",1408668,1489652,1419604,1409313,1370001,-39312,-2.8000000000000001E-2,302,null,"NO","NO",null,null,null,null,-2.7449335116578214E-2,null,null,null,null,null,"Queens","Kew Gardens-Union Turnpike [E, F]"]
["Brooklyn","20 Av [N]",1074076,1183329,1253690,1194973,1220065,25092,2.1000000000000001E-2,325,null,"NO","NO",null,null,null,null,0.13592054938384249,null,null,null,null,null,"Queens","Sutphin Blvd-Archer Av-JFK Airport [E, J, Z]"]
["Brooklyn","25 Av [D]",1354147,1404084,1329003,1328491,1266146,-62345,-4.7E-2,317,null,"NO","NO",null,null,null,null,-6.4986297647153524E-2,null,null,null,null,null,"Queens","Woodhaven Blvd [M, R]"]
["Brooklyn","25 St [R]",1199657,1223561,1179455,1208827,1243737,34910,2.9000000000000001E-2,320,null,"NO","NO",null,null,null,null,3.6743835946441358E-2,null,null,null,null,null,"Queens","Woodside-61 St [7]"]
["Brooklyn","36 St [D, N, R]",3344295,3567379,3444333,3567832,3659139,91307,2.5999999999999999E-2,128,null,"NO","NO",null,null,null,null,9.4143608742649793E-2]
["Brooklyn","4 Av [F, G, R]",3220717,3433636,3494753,3672622,4020665,348043,9.5000000000000001E-2,116,null,"NO","YES",null,null,null,null,0.2483757498718453]
["Brooklyn","45 St [R]",2285612,2358187,2317470,2284356,2328141,43785,1.9E-2,198,null,"NO","NO",null,null,null,null,1.8607270175340345E-2]
["Brooklyn","50 St [D]",1002804,1008658,944314,942902,897609,-45293,-4.8000000000000001E-2,365,null,"NO","NO",null,null,null,null,-0.1049008579941843]
["Brooklyn","53 St [R]",2416483,2453450,2382707,2370851,2401105,30254,1.2999999999999999E-2,191,null,"NO","NO",null,null,null,null,-6.3637939931710675E-3]
["Brooklyn","55 St [D]",622180,627136,577138,580913,586282,5369,8.9999999999999993E-3,395,null,"NO","NO",null,null,null,null,-5.7697129448069692E-2]
["Brooklyn","59 St [N, R]",3705952,3833772,3736347,3867990,3819141,-48849,-1.2999999999999999E-2,124,null,"NO","NO",null,null,null,null,3.05424894871817E-2]
["Brooklyn","7 Av [B, Q]",2919809,3071778,3014532,3064214,2953368,-110846,-3.5999999999999997E-2,165,null,"NO","NO",null,null,null,null,1.1493560023960471E-2]
["Brooklyn","7 Av [F, G]",3507448,3451277,3316537,3397045,3934545,537500,0.158,119,null,"NO","NO",null,null,null,null,0.12176859072465222]
["Brooklyn","71 St [D]",1384920,1434010,1308071,1332009,1115321,-216688,-0.16300000000000001,335,null,"NO","NO",null,null,null,null,-0.19466756202524332]
["Brooklyn","77 St [R]",1503433,1584765,1539875,1545617,1579635,34018,2.1999999999999999E-2,278,null,"NO","NO",null,null,null,null,5.0685331504629734E-2]
["Brooklyn","79 St [D]",1730863,1781752,1694385,1728820,1633616,-95204,-5.5E-2,272,null,"NO","NO",null,null,null,null,-5.6184111625241284E-2]
["Brooklyn","8 Av [N]",2943759,3196930,3384130,3475890,3484429,8539,2E-3,135,null,"NO","YES",null,null,null,null,0.18366652976687289]
["Brooklyn","86 St [N]",619906,684815,736775,770621,796379,25758,3.3000000000000002E-2,381,null,"NO","YES",null,null,null,null,0.28467703167899649]
["Brooklyn","86 St [R]",3226321,3343893,3274415,3306164,3445470,139306,4.2000000000000003E-2,138,null,"NO","NO",null,null,null,null,6.7925355226587811E-2]
["Brooklyn","9 Av [D]",1861608,1968068,1873361,1863019,1681423,-181596,-9.7000000000000003E-2,265,null,"NO","NO",null,null,null,null,-9.6789979415644975E-2]
["Brooklyn","Alabama Av [J]",605337,675258,683329,712714,759581,46867,6.6000000000000003E-2,384,null,"NO","YES",null,null,null,null,0.25480682661063175]
["Brooklyn","Atlantic Av [B, Q, 2, 3, 4, 5, D, N, R]",9643487,10121151,10039490,10478354,10726332,247978,2.4E-2,28,null,"NO","NO",null,null,null,null,0.11228770257065727]
["Brooklyn","Atlantic Av [L]",339874,386672,395884,424208,427914,3706,8.9999999999999993E-3,409,null,"NO","YES",null,null,null,null,0.25903717259925735]
["Brooklyn","Avenue H [Q]",850208,887650,819739,662564,521818,-140746,-0.21199999999999999,403,null,"NO","NO",null,null,null,null,-0.38624665964093491]
["Brooklyn","Avenue I [F]",736191,741356,725876,708788,696851,-11937,-1.7000000000000001E-2,390,null,"NO","NO",null,null,null,null,-5.3437219417243623E-2]
["Brooklyn","Avenue J [Q]",1973706,2031548,1886881,2059453,2085557,26104,1.2999999999999999E-2,224,null,"NO","NO",null,null,null,null,5.6670547690486829E-2]
["Brooklyn","Avenue M [Q]",1751074,1851760,1661369,1351418,1345774,-5644,-4.0000000000000001E-3,305,null,"NO","NO",null,null,null,null,-0.23145795094896046]
["Brooklyn","Avenue N [F]",1051230,1067437,999622,1016781,1049752,32971,3.2000000000000001E-2,347,null,"NO","NO",null,null,null,null,-1.4059720517869544E-3]
["Brooklyn","Avenue P [F]",892585,900117,830813,829508,836317,6809,8.0000000000000002E-3,371,null,"NO","NO",null,null,null,null,-6.3039374401317516E-2]
["Brooklyn","Avenue U [F]",676788,678084,673170,723222,696998,-26224,-3.5999999999999997E-2,389,null,"NO","NO",null,null,null,null,2.9861640572823395E-2]
["Brooklyn","Avenue U  [N]",984530,1116116,1255861,1263986,1244178,-19808,-1.6E-2,319,null,"NO","NO",null,null,null,null,0.26372787015123966]
["Brooklyn","Avenue U  [Q]",2271140,2312053,1829675,1325173,2136714,811541,0.61199999999999999,215,null,"NO","NO",null,null,null,null,-5.9188777442165608E-2]
["Brooklyn","Avenue X [F]",886355,877399,833930,843207,854737,11530,1.4E-2,369,null,"NO","NO",null,null,null,null,-3.567193731631231E-2]
["Brooklyn","Bay 50 St [D]",873104,871867,941332,969133,920243,-48890,-0.05,360,null,"NO","NO",null,null,null,null,5.3990131759790359E-2]
["Brooklyn","Bay Pkwy [D]",2145203,2241011,2088844,2107643,2018400,-89243,-4.2000000000000003E-2,229,null,"NO","NO",null,null,null,null,-5.9110023620142241E-2]
["Brooklyn","Bay Pkwy [F]",448356,441249,417087,427277,434564,7287,1.7000000000000001E-2,408,null,"NO","NO",null,null,null,null,-3.0761270062182731E-2]
["Brooklyn","Bay Pkwy [N]",1725387,1940220,2090204,2107881,2160569,52688,2.5000000000000001E-2,214,null,"NO","YES",null,null,null,null,0.25222283464521295]
["Brooklyn","Bay Ridge Av [R]",2438750,2549155,2505035,2483394,2538150,54756,2.1999999999999999E-2,183,null,"NO","NO",null,null,null,null,4.0758585340850848E-2]
["Brooklyn","Bay Ridge-95 St [R]",1679876,1732989,1700946,1719577,1769432,49855,2.9000000000000001E-2,257,null,"NO","NO",null,null,null,null,5.3311077722403323E-2]
["Brooklyn","Bedford Av [L]",5766688,6504331,6761478,7418203,7738863,320660,4.2999999999999997E-2,46,null,"NO","YES",null,null,null,null,0.34199439955829064]
["Brooklyn","Bedford-Nostrand Avs [G]",1660873,1820311,1876400,1895163,2012606,117443,6.2E-2,230,null,"NO","YES",null,null,null,null,0.21177597564654252]
["Brooklyn","Bergen St [2, 3]",1207019,1236037,1238795,1265510,1326721,61211,4.8000000000000001E-2,307,null,"NO","YES",null,null,null,null,9.9171595476127555E-2]
["Brooklyn","Bergen St [F, G]",3126241,3169916,3228987,3296466,3452452,155986,4.7E-2,137,null,"NO","YES",null,null,null,null,0.10434608208388285]
["Brooklyn","Beverley Rd [Q]",900828,917474,889066,1070872,1095502,24630,2.3E-2,342,null,"NO","NO",null,null,null,null,0.21610562726735846]
["Brooklyn","Beverly Rd [2, 5]",1244565,1271764,1219695,1231592,1276466,44874,3.5999999999999997E-2,316,null,"NO","NO",null,null,null,null,2.5632249018733452E-2]
["Brooklyn","Brighton Beach [B, Q]",3895150,4125373,3997205,3995043,3842789,-152254,-3.7999999999999999E-2,123,null,"NO","NO",null,null,null,null,-1.3442614533458274E-2]
["Brooklyn","Broadway [G]",1006749,1032689,1047629,941243,995856,54613,5.8000000000000003E-2,353,null,"NO","NO",null,null,null,null,-1.0819975982096828E-2]
["Brooklyn","Broadway Junction [A, C, J, L, Z]",2907085,2937794,2846582,2767838,2810713,42875,1.4999999999999999E-2,169,null,"NO","NO",null,null,null,null,-3.3150733466685699E-2]
["Brooklyn","Bushwick Av-Aberdeen St [L]",315597,366270,365349,398834,405385,6551,1.6E-2,410,null,"NO","NO",null,null,null,null,0.28450207067874539]
["Brooklyn","Canarsie-Rockaway Pkwy [L]",3601731,3773940,3660047,3806903,3865823,58920,1.4999999999999999E-2,121,null,"NO","NO",null,null,null,null,7.3323632442289552E-2]
["Brooklyn","Carroll St [F, G]",3059642,3089357,2995068,3025719,3598477,572758,0.189,130,null,"NO","NO",null,null,null,null,0.17611047305534439]
["Brooklyn","Central Av [M]",620228,684847,747651,760657,890194,129537,0.17,367,null,"NO","YES",null,null,null,null,0.43526896560619643]
["Brooklyn","Chauncey St [J, Z]",771353,822076,847239,898984,966989,68005,7.5999999999999998E-2,357,null,"NO","YES",null,null,null,null,0.25362706828131865]
["Brooklyn","Church Av [2, 5]",2921895,2949285,2872287,2994162,3057877,63715,2.1000000000000001E-2,155,null,"NO","NO",null,null,null,null,4.6538975562092411E-2]
["Brooklyn","Church Av [B, Q]",4875322,5173847,4966209,4654613,4665059,10446,2E-3,95,null,"NO","NO",null,null,null,null,-4.312802313365148E-2]
["Brooklyn","Church Av [F, G]",2941806,2965803,2908011,2968167,3271729,303562,0.10199999999999999,143,null,"NO","NO",null,null,null,null,0.11214981545350033]
["Brooklyn","Clark St [2, 3]",1592264,1627465,1706174,1711829,1754204,42375,2.5000000000000001E-2,259,null,"NO","YES",null,null,null,null,0.10170424000040194]
["Brooklyn","Classon Av [G]",1102407,1145468,1186685,1207680,1308232,100552,8.3000000000000004E-2,310,null,{"$f":"IF(AND(G132<F132,F132<E132,E132<D132,D132<C132),\"YES\",\"NO\")","v":"NO"},{"$f":"IF(AND(G132>F132,F132>E132,E132>D132,D132>C132),\"YES\",\"NO\")","v":"YES"},null,null,null,null,{"$f":"IFERROR((G132-C132)/C132,\"\")","v":0.18670509167666752}]
["Brooklyn","Cleveland St [J]",818018,937050,951023,970732,1002848,32116,3.3000000000000002E-2,352,null,"NO","YES",null,null,null,null,0.22594857325877915]
["Brooklyn","Clinton-Washington Avs [C]",1531187,1636635,1559809,1707500,1819542,112042,6.6000000000000003E-2,248,null,"NO","NO",null,null,null,null,0.18832121746070205]
["Brooklyn","Clinton-Washington Avs [G]",1417193,1464016,1503550,1517296,1628558,111262,7.2999999999999995E-2,273,null,"NO","YES",null,null,null,null,0.14914341236514717]
["Brooklyn","Coney Island-Stillwell Av [D, F, N, Q]",4258403,4482958,4378886,4768416,4649438,-118978,-2.5000000000000001E-2,96,null,"NO","NO",null,null,null,null,9.1826677747502999E-2]
["Brooklyn","Cortelyou Rd [Q]",1883312,1985030,1879021,2086918,2135444,48526,2.3E-2,216,null,"NO","NO",null,null,null,null,0.13387691471195426]
["Brooklyn","Court St [R, 2, 3, 4, 5]",10147974,10698228,10788326,11134599,11115037,-19562,-2E-3,27,null,"NO","NO",null,null,null,null,9.5296164534911104E-2]
["Brooklyn","Crescent St [J, Z]",1277248,1436424,1400697,1464238,1514075,49837,3.4000000000000002E-2,287,null,"NO","NO",null,null,null,null,0.18541974620433932]
["Brooklyn","Crown Heights-Utica Av [3, 4]",8303467,8573661,8330192,8498343,8438284,-60059,-7.0000000000000001E-3,37,null,"NO","NO",null,null,null,null,1.6236229998866737E-2]
["Brooklyn","Cypress Hills [J]",425388,429277,427322,419062,435446,16384,3.9E-2,407,null,"NO","NO",null,null,null,null,2.3644296501076665E-2]
["Brooklyn","DeKalb Av [B, Q, R]",4843313,5043274,5014623,5079961,5122803,42842,8.0000000000000002E-3,86,null,"NO","NO",null,null,null,null,5.7706367521570462E-2]
["Brooklyn","DeKalb Av [L]",3024645,3329950,3110345,3343666,3382468,38802,1.2E-2,140,null,"NO","NO",null,null,null,null,0.11830247847268026]
["Brooklyn","Ditmas Av [F]",1484299,1478231,1398512,1377549,1392790,15241,1.0999999999999999E-2,299,null,"NO","NO",null,null,null,null,-6.1651324968891037E-2]
["Brooklyn","East 105 St [L]",933164,1017671,1014253,1065469,1101683,36214,3.4000000000000002E-2,339,null,"NO","NO",null,null,null,null,0.18058883540299453]
["Brooklyn","Eastern Pkwy-Brooklyn Museum [2, 3]",1564980,1602404,1557736,1590190,1568924,-21266,-1.2999999999999999E-2,281,null,"NO","NO",null,null,null,null,2.5201600020447546E-3]
["Brooklyn","Euclid Av [A, C]",2866128,2995164,2888392,3004395,3100867,96472,3.2000000000000001E-2,153,null,"NO","NO",null,null,null,null,8.19010874601553E-2]
["Brooklyn","Flatbush Av-Brooklyn College [2, 5]",5849991,6035079,5951280,6335954,6547958,212004,3.3000000000000002E-2,63,null,"NO","NO",null,null,null,null,0.11931078184564728]
["Brooklyn","Flushing Av [G]",596342,599449,582662,553739,616083,62344,0.113,394,null,"NO","NO",null,null,null,null,3.3103487596043882E-2]
["Brooklyn","Flushing Av [J, M]",2189891,2359615,2472600,2610974,2683278,72304,2.8000000000000001E-2,179,null,"NO","YES",null,null,null,null,0.22530208124513959]
["Brooklyn","Fort Hamilton Pkwy [D]",1148030,1188918,1159841,1154051,1103024,-51027,-4.3999999999999997E-2,338,null,"NO","NO",null,null,null,null,-3.9202808288981997E-2]
["Brooklyn","Fort Hamilton Pkwy [F, G]",1419753,1474745,1468106,1509737,1292131,-217606,-0.14399999999999999,314,null,"NO","NO",null,null,null,null,-8.9890283732452059E-2]
["Brooklyn","Fort Hamilton Pkwy [N]",1839810,1979256,1994402,2045741,2086389,40648,0.02,223,null,"NO","YES",null,null,null,null,0.13402416553883281]
["Brooklyn","Franklin Av [2, 3, 4, 5, S]",4013780,4228510,4302121,4433981,4712492,278511,6.3E-2,93,null,"NO","YES",null,null,null,null,0.17407830025561938]
["Brooklyn","Franklin Av [C, S]",1562157,1659913,1608062,1768472,1904736,136264,7.6999999999999999E-2,244,null,"NO","NO",null,null,null,null,0.21929870045072294]
["Brooklyn","Fulton St [G]",935284,1013751,1089757,1098862,1179034,80172,7.2999999999999995E-2,327,null,"NO","YES",null,null,null,null,0.26061602678972379]
["Brooklyn","Gates Av [J, Z]",1495901,1609242,1666134,1749349,1870109,120760,6.9000000000000006E-2,245,null,"NO","YES",null,null,null,null,0.25015559184732145]
["Brooklyn","Graham Av [L]",2505392,2727719,2717687,3028830,3054897,26067,8.9999999999999993E-3,156,null,"NO","NO",null,null,null,null,0.21932895131779778]
["Brooklyn","Grand Army Plaza [2, 3]",2412986,2412424,2366786,2369355,2417351,47996,0.02,189,null,"NO","NO",null,null,null,null,1.8089620080680121E-3]
["Brooklyn","Grand St [L]",1925383,2075718,1981342,2103847,2135063,31216,1.4999999999999999E-2,217,null,"NO","NO",null,null,null,null,0.1089030078690837]
["Brooklyn","Grant Av [A]",1858974,1940737,1898215,1910245,1953637,43392,2.3E-2,236,null,"NO","NO",null,null,null,null,5.0922175350489034E-2]
["Brooklyn","Greenpoint Av [G]",2305443,2392113,2319327,2200679,2490286,289607,0.13200000000000001,186,null,"NO","NO",null,null,null,null,8.0176781642400177E-2]
["Brooklyn","Halsey St [J]",1503525,1619882,1632375,1730267,1805490,75223,4.2999999999999997E-2,252,null,"NO","YES",null,null,null,null,0.20083803062802413]
["Brooklyn","Halsey St [L]",1758909,1946762,1907900,2019248,2037729,18481,8.9999999999999993E-3,228,null,"NO","NO",null,null,null,null,0.15851871813720891]
["Brooklyn","Hewes St [J, M]",657361,703052,744898,785545,848377,62832,0.08,370,null,"NO","YES",null,null,null,null,0.29058006179253104]
["Brooklyn","High St [A, C]",1746191,1915125,1888271,1968091,2093306,125215,6.4000000000000001E-2,222,null,"NO","NO",null,null,null,null,0.19878409635601146]
["Brooklyn","Hoyt St [2, 3]",1986330,1938805,1902962,1839662,1922916,83254,4.4999999999999998E-2,241,null,"NO","NO",null,null,null,null,-3.1925208802162784E-2]
["Brooklyn","Hoyt-Schermerhorn Sts [A, C, G]",2641181,2897619,2862942,2923091,2968639,45548,1.6E-2,161,null,"NO","NO",null,null,null,null,0.12398165820517412]
["Brooklyn","Jay St-MetroTech [A, C, F, R]",10429024,10642207,10355187,10488087,11149629,661542,6.3E-2,26,null,"NO","NO",null,null,null,null,6.90961110071278E-2]
["Brooklyn","Jefferson St [L]",1403678,1569253,1581941,1740644,1815391,74747,4.2999999999999997E-2,249,null,"NO","YES",null,null,null,null,0.29331014662907018]
["Brooklyn","Junius St [3]",645442,660409,628879,672366,678990,6624,0.01,393,null,"NO","NO",null,null,null,null,5.1976784900889625E-2]
["Brooklyn","Kings Hwy [B, Q]",5470271,5821580,5549765,5755515,5311662,-443853,-7.6999999999999999E-2,81,null,"NO","NO",null,null,null,null,-2.8994724392996253E-2]
["Brooklyn","Kings Hwy [F]",1106013,1105178,1038778,1073519,1115062,41543,3.9E-2,336,null,"NO","NO",null,null,null,null,8.1816398179768227E-3]
["Brooklyn","Kings Hwy [N]",1406790,1530933,1584172,1602420,1601357,-1063,-1E-3,276,null,"NO","NO",null,null,null,null,0.13830564618741958]
["Brooklyn","Kingston Av [3]",1486763,1544975,1450448,1485344,1519113,33769,2.3E-2,286,null,"NO","NO",null,null,null,null,2.1758679762679055E-2]
["Brooklyn","Kingston-Throop Avs [C]",1513915,1577316,1501234,1571551,1659127,87576,5.6000000000000001E-2,266,null,"NO","NO",null,null,null,null,9.5918198842075017E-2]
["Brooklyn","Knickerbocker Av [M]",965345,1018665,1054258,1007087,1136213,129126,0.128,332,null,"NO","NO",null,null,null,null,0.17700200446472505]
["Brooklyn","Kosciuszko St [J]",1198873,1293503,1324395,1401401,1468119,66718,4.8000000000000001E-2,294,null,"NO","YES",null,null,null,null,0.22458258714642834]
["Brooklyn","Lafayette Av [C]",1339622,1472253,1410635,1525942,1556902,30960,0.02,283,null,"NO","NO",null,null,null,null,0.16219500724831332]
["Brooklyn","Liberty Av [C]",891810,898961,872268,837165,817481,-19684,-2.4E-2,376,null,"NO","NO",null,null,null,null,-8.3346228456734062E-2]
["Brooklyn","Livonia Av [L]",603620,691560,704067,785229,829015,43786,5.6000000000000001E-2,372,null,"NO","YES",null,null,null,null,0.37340545376230078]
["Brooklyn","Lorimer St [J, M]",1233330,1345921,1379364,1404557,1470761,66204,4.7E-2,292,null,"NO","YES",null,null,null,null,0.19251214192470789]
["Brooklyn","Lorimer St [L, G]",3859353,3831975,4273071,4394498,4479022,84524,1.9E-2,101,null,"NO","NO",null,null,null,null,0.16056292337083444]
["Brooklyn","Marcy Av [J, M, Z]",2600039,2897071,3007825,3276009,3609981,333972,0.10199999999999999,129,null,"NO","YES",null,null,null,null,0.38843340426816675]
["Brooklyn","Montrose Av [L]",1593816,1747376,1718655,1951066,1983449,32383,1.7000000000000001E-2,233,null,"NO","NO",null,null,null,null,0.24446548409603117]
["Brooklyn","Morgan Av [L]",1455193,1664668,1684084,2021162,2114813,93651,4.5999999999999999E-2,219,null,"NO","YES",null,null,null,null,0.45328695231491628]
["Brooklyn","Myrtle Av [J, M, Z]",2434091,2676471,2748162,2991967,3155344,163377,5.5E-2,151,null,"NO","YES",null,null,null,null,0.29631307950277946]
["Brooklyn","Myrtle-Willoughby Avs [G]",1192656,1307569,1346184,1223378,1383197,159819,0.13100000000000001,301,null,"NO","NO",null,null,null,null,0.15976190955313183]
["Brooklyn","Myrtle-Wyckoff Avs [L, M]",4710774,5230077,5111569,5399769,5358434,-41335,-8.0000000000000002E-3,79,null,"NO","NO",null,null,null,null,0.13748483794807392]
["Brooklyn","Nassau Av [G]",2363088,2391486,2321809,2126804,2396169,269365,0.127,192,null,"NO","NO",null,null,null,null,1.3999055473177469E-2]
["Brooklyn","Neck Rd [Q]",1148045,1172413,954832,791867,1242661,450794,0.56899999999999995,321,null,"NO","NO",null,null,null,null,8.2414887918156515E-2]
["Brooklyn","Neptune Av [F]",492359,490569,480865,516846,536991,20145,3.9E-2,401,null,"NO","NO",null,null,null,null,9.0649302642990176E-2]
["Brooklyn","Nevins St [2, 3, 4, 5]",3369278,3459284,3479130,3566500,3524471,-42029,-1.2E-2,133,null,"NO","NO",null,null,null,null,4.6061203616917332E-2]
["Brooklyn","New Lots Av [3]",1783927,1840488,1781691,1885350,1954353,69003,3.6999999999999998E-2,235,null,"NO","NO",null,null,null,null,9.5534178248325177E-2]
["Brooklyn","New Lots Av [L]",939010,1072250,1138348,1231257,1304384,73127,5.8999999999999997E-2,312,null,"NO","YES",null,null,null,null,0.38910554733176428]
["Brooklyn","New Utrecht Av [N, D]",1672534,1689985,1645572,1692800,1768935,76135,4.4999999999999998E-2,258,null,{"$f":"IF(AND(G196<F196,F196<E196,E196<D196,D196<C196),\"YES\",\"NO\")","v":"NO"},{"$f":"IF(AND(G196>F196,F196>E196,E196>D196,D196>C196),\"YES\",\"NO\")","v":"NO"},null,null,null,null,{"$f":"IFERROR((G196-C196)/C196,\"\")","v":5.7637692268139244E-2}]
["Brooklyn","Newkirk Av [2, 5]",2337181,2403333,2298052,2347178,2352060,4882,2E-3,196,null,"NO","NO",null,null,null,null,6.3662163948791303E-3]
["Brooklyn","Newkirk Plaza [B, Q]",2988166,3138236,2842893,2867372,2999870,132498,4.5999999999999999E-2,159,null,"NO","NO",null,null,null,null,3.916783739591442E-3]
["Brooklyn","Norwood Av [J, Z]",1009451,1077051,1041356,1056263,1065062,8799,8.0000000000000002E-3,345,null,"NO","NO",null,null,null,null,5.5090341185456256E-2]
["Brooklyn","Nostrand Av [3]",1251246,1250756,1200968,1290482,1324424,33942,2.5999999999999999E-2,308,null,"NO","NO",null,null,null,null,5.8484103046083667E-2]
["Brooklyn","Nostrand Av [A, C]",4666962,5034844,4676059,4863842,5139201,275359,5.7000000000000002E-2,85,null,"NO","NO",null,null,null,null,0.10118766769474447]
["Brooklyn","Ocean Pkwy [Q]",935145,969515,973380,1057060,1033582,-23478,-2.1999999999999999E-2,349,null,"NO","NO",null,null,null,null,0.10526388955723444]
["Brooklyn","Park Pl [S]",750049,767373,715532,710863,707253,-3610,-5.0000000000000001E-3,388,null,"NO","NO",null,null,null,null,-5.7057605569769444E-2]
["Brooklyn","Parkside Av [Q]",1827294,1855373,1777758,2050518,2098007,47489,2.3E-2,221,null,"NO","NO",null,null,null,null,0.14814966830734408]
["Brooklyn","Pennsylvania Av [3]",1825213,1865416,1786525,1805195,1805956,761,0,251,null,"NO","NO",null,null,null,null,-1.0550549442722575E-2]
["Brooklyn","President St [2, 5]",1029299,1065963,1044562,1130601,1133831,3230,3.0000000000000001E-3,333,null,"NO","NO",null,null,null,null,0.1015564962173285]
["Brooklyn","Prospect Av [R]",1788418,1876991,1860934,1863247,1930101,66854,3.5999999999999997E-2,240,null,"NO","NO",null,null,null,null,7.9222530750641063E-2]
["Brooklyn","Prospect Park [B, Q, S]",2706111,2824450,2955204,2867309,2815199,-52110,-1.7999999999999999E-2,168,null,"NO","NO",null,null,null,null,4.0311724094096654E-2]
["Brooklyn","Ralph Av [C]",1434216,1498036,1450900,1529747,1585546,55799,3.5999999999999997E-2,277,null,"NO","NO",null,null,null,null,0.10551409271685716]
["Brooklyn","Rockaway Av [3]",1759237,1825246,1758538,1787382,1792136,4754,3.0000000000000001E-3,253,null,"NO","NO",null,null,null,null,1.870072082385716E-2]
["Brooklyn","Rockaway Av [C]",1446190,1522803,1480189,1499681,1548571,48890,3.3000000000000002E-2,284,null,"NO","NO",null,null,null,null,7.0793602500363026E-2]
["Brooklyn","Saratoga Av [3]",1673813,1720382,1663923,1699652,1743578,43926,2.5999999999999999E-2,260,null,"NO","NO",null,null,null,null,4.1680283281346243E-2]
["Brooklyn","Sheepshead Bay [B, Q]",4298721,4455963,4361205,4481755,4096449,-385306,-8.5999999999999993E-2,112,null,"NO","NO",null,null,null,null,-4.7053995828061419E-2]
["Brooklyn","Shepherd Av [C]",912247,966964,922420,917964,930613,12649,1.4E-2,358,null,"NO","NO",null,null,null,null,2.0132705287054933E-2]
["Brooklyn","Smith-9 Sts [F, G]",1313577,1439644,1465834,1501360,577571,-923789,-0.61499999999999999,397,null,"NO","NO",null,null,null,null,-0.56030670451751208]
["Brooklyn","Sterling St [2, 5]",1654595,1684561,1636794,1743151,1787824,44673,2.5999999999999999E-2,254,null,"NO","NO",null,null,null,null,8.0520610783907848E-2]
["Brooklyn","Sutter Av [L]",1001950,1104244,1168953,1280175,1303422,23247,1.7999999999999999E-2,313,null,"NO","YES",null,null,null,null,0.30088527371625329]
["Brooklyn","Sutter Av-Rutland Rd [3]",2282569,2335881,2219406,2317306,2370949,53643,2.3E-2,195,null,"NO","NO",null,null,null,null,3.8719530493930301E-2]
["Brooklyn","Union St [R]",1984448,2071096,2067255,2126492,2228520,102028,4.8000000000000001E-2,206,null,"NO","NO",null,null,null,null,0.12299238881542877]
["Brooklyn","Utica Av [A, C]",4171867,4435837,4235887,4272623,4437282,164659,3.9E-2,103,null,"NO","NO",null,null,null,null,6.362019690464725E-2]
["Brooklyn","Van Siclen Av [3]",914388,958573,956623,1023416,1061359,37943,3.6999999999999998E-2,346,null,"NO","NO",null,null,null,null,0.16073154940790998]
["Brooklyn","Van Siclen Av [C]",833443,915167,869166,893234,901530,8296,8.9999999999999993E-3,364,null,"NO","NO",null,null,null,null,8.1693649115776368E-2]
["Brooklyn","Van Siclen Av [J, Z]",717189,780986,808772,828566,886663,58097,7.0000000000000007E-2,368,null,"NO","YES",null,null,null,null,0.23630312232898162]
["Brooklyn","West 8 St-New York Aquarium [F, Q]",772932,809964,779782,867792,814749,-53043,-6.0999999999999999E-2,377,null,"NO","NO",null,null,null,null,5.410178385679465E-2]
["Brooklyn","Wilson Av [L]",931948,1055011,1067833,1089448,1093030,3582,3.0000000000000001E-3,343,null,"NO","YES",null,null,null,null,0.17284440762789341]
["Brooklyn","Winthrop St [2, 5]",1936151,2022238,2006133,2110081,2173945,63864,0.03,210,null,"NO","NO",null,null,null,null,0.12281790005015104]
["Brooklyn","York St [F]",1603908,1855120,1913869,2041208,2251649,210441,0.10299999999999999,204,null,"NO","YES",null,null,null,null,0.40385171718078594]
["Manhattan","1 Av [L]",5598821,6201745,6490329,6936132,7050336,114204,1.6E-2,53,null,"NO","YES",null,null,null,null,0.25925368930351589]
["Manhattan","103 St [1]",4347657,4447213,4419549,4167100,4302101,135001,3.2000000000000001E-2,107,null,"NO","NO",null,null,null,null,-1.0478287500600899E-2]
["Manhattan","103 St [6]",4402659,4573700,4631356,4799555,4901637,102082,2.1000000000000001E-2,89,null,"NO","YES",null,null,null,null,0.11333560014527584]
["Manhattan","103 St [B, C]",1535588,1599818,1524460,1556919,1453267,-103652,-6.7000000000000004E-2,295,null,"NO","NO",null,null,null,null,-5.3608780480180883E-2]
["Manhattan","110 St [6]",3521483,3626056,3668518,3722821,3771563,48742,1.2999999999999999E-2,125,null,"NO","YES",null,null,null,null,7.1015535216271103E-2]
["Manhattan","116 St [2, 3]",3053832,3156704,3281869,3225207,3439949,214742,6.7000000000000004E-2,139,null,"NO","NO",null,null,null,null,0.12643688323391725]
["Manhattan","116 St [6]",4585336,4798220,4849246,5100170,5253753,153583,0.03,82,null,"NO","YES",null,null,null,null,0.14577274162678591]
["Manhattan","116 St [B, C]",1682020,1849963,1838683,1921860,1944599,22739,1.2E-2,238,null,"NO","NO",null,null,null,null,0.15610932093554178]
["Manhattan","116 St-Columbia University [1]",4825577,4912623,4870652,4774192,4932065,157873,3.3000000000000002E-2,87,null,"NO","NO",null,null,null,null,2.2067412871041123E-2]
["Manhattan","125 St [1]",2358932,2444771,2402477,2358252,2438449,80197,3.4000000000000002E-2,188,null,"NO","NO",null,null,null,null,3.3708898772834485E-2]
["Manhattan","125 St [2, 3]",4196876,4342867,4514621,4317843,4518487,200644,4.5999999999999999E-2,100,null,"NO","NO",null,null,null,null,7.6631046521269633E-2]
["Manhattan","125 St [4, 5, 6]",8295082,8681735,8710718,8834429,8868272,33843,4.0000000000000001E-3,34,null,"NO","YES",null,null,null,null,6.9099979964031694E-2]
["Manhattan","125 St [A, B, C, D]",7612421,7986389,7872649,8003946,8173608,169662,2.1000000000000001E-2,40,null,"NO","NO",null,null,null,null,7.3719911182001094E-2]
["Manhattan","135 St [2, 3]",3853829,3944165,4022802,4043860,4344677,300817,7.3999999999999996E-2,104,null,"NO","YES",null,null,null,null,0.12736631542292096]
["Manhattan","135 St [B, C]",1391512,1467646,1428140,1511387,1575802,64415,4.2999999999999997E-2,279,null,"NO","NO",null,null,null,null,0.13243867102834903]
["Manhattan","137 St-City College [1]",4515446,4618524,4523575,4436971,4546654,109683,2.5000000000000001E-2,99,null,"NO","NO",null,null,null,null,6.9113881552342778E-3]
["Manhattan","14 St [A, C, E, L]",10985541,11568852,11129412,11795495,12415290,619795,5.2999999999999999E-2,21,null,"NO","NO",null,null,null,null,0.13014825578458084]
["Manhattan","14 St [F, M, 1, 2, 3, L]",14761349,15304268,15220076,15029178,15199211,170033,1.0999999999999999E-2,17,null,"NO","NO",null,null,null,null,2.9662736109010091E-2]
["Manhattan","14 St-Union Sq [L, N, Q, R, 4, 5, 6]",33744169,35545653,34245245,34730692,34927178,196486,6.0000000000000001E-3,4,null,"NO","NO",null,null,null,null,3.5058175532489778E-2]
["Manhattan","145 St [1]",3166049,3191262,3128091,3115174,3138419,23245,7.0000000000000001E-3,152,null,"NO","NO",null,null,null,null,-8.7269653754569187E-3]
["Manhattan","145 St [3]",790639,826061,878906,873390,981914,108524,0.124,356,null,"NO","NO",null,null,null,null,0.24192456987322913]
["Manhattan","145 St [A, B, C, D]",6176544,6602419,6446603,6694537,6948193,253656,3.7999999999999999E-2,57,null,"NO","NO",null,null,null,null,0.12493216271105653]
["Manhattan","155 St [B, D]",1181067,1199549,1199677,1241223,1248295,7072,6.0000000000000001E-3,318,null,"NO","YES",null,null,null,null,5.6921410893708821E-2]
["Manhattan","155 St [C]",726080,739611,710556,735801,792465,56664,7.6999999999999999E-2,382,null,"NO","NO",null,null,null,null,9.1429319083296601E-2]
["Manhattan","157 St [1]",3213412,3255229,3251747,3238373,3259408,21035,6.0000000000000001E-3,144,null,"NO","NO",null,null,null,null,1.4313757464028888E-2]
["Manhattan","163 St-Amsterdam Av [C]",1162204,1167101,1142625,1193933,1221336,27403,2.3E-2,323,null,"NO","NO",null,null,null,null,5.0879191604916177E-2]
["Manhattan","168 St [A, C, 1]",7068332,7703324,7532891,7325739,7500154,174415,2.4E-2,48,null,"NO","NO",null,null,null,null,6.1092489713273232E-2]
["Manhattan","175 St [A]",3754654,3606024,3500536,3783719,4029936,246217,6.5000000000000002E-2,115,null,"NO","NO",null,null,null,null,7.3317541376648823E-2]
["Manhattan","18 St [1]",2427699,2457457,2407729,2435685,2497134,61449,2.5000000000000001E-2,184,null,"NO","NO",null,null,null,null,2.8601156897951518E-2]
["Manhattan","181 St [1]",3583169,3764024,3551740,3429260,3171483,-257777,-7.4999999999999997E-2,148,null,"NO","NO",null,null,null,null,-0.11489438538902295]
["Manhattan","181 St [A]",3040302,2876719,2877894,3106184,3245786,139602,4.4999999999999998E-2,145,null,"NO","NO",null,null,null,null,6.75867068468856E-2]
["Manhattan","190 St [A]",1242833,1175432,1177378,1287568,1445656,158088,0.123,297,null,"NO","NO",null,null,null,null,0.16319408963231585]
["Manhattan","191 St [1]",2441749,2562177,2432768,2344317,2318562,-25755,-1.0999999999999999E-2,200,null,{"$f":"IF(AND(G260<F260,F260<E260,E260<D260,D260<C260),\"YES\",\"NO\")","v":"NO"},{"$f":"IF(AND(G260>F260,F260>E260,E260>D260,D260>C260),\"YES\",\"NO\")","v":"NO"},null,null,null,null,{"$f":"IFERROR((G260-C260)/C260,\"\")","v":-5.0450312460453554E-2}]
["Manhattan","2 Av [F]",5501841,5845342,5734200,5627896,5728217,100321,1.7999999999999999E-2,71,null,"NO","NO",null,null,null,null,4.1145500206203708E-2]
["Manhattan","207 St [1]",1711716,1907159,1919631,1875395,2054287,178892,9.5000000000000001E-2,226,null,"NO","NO",null,null,null,null,0.20013308282448725]
["Manhattan","215 St [1]",474222,597454,635361,582955,583486,531,1E-3,396,null,"NO","NO",null,null,null,null,0.23040685586075721]
["Manhattan","23 St [1]",4658455,4615267,4516335,4517687,4622230,104543,2.3E-2,98,null,"NO","NO",null,null,null,null,-7.7761833054091969E-3]
["Manhattan","23 St [6]",9049048,9239171,8914123,8925824,8999142,73318,8.0000000000000002E-3,33,null,"NO","NO",null,null,null,null,-5.5150552853736661E-3]
["Manhattan","23 St [C, E]",6785651,7060491,6819642,6707382,7001778,294396,4.3999999999999997E-2,55,null,"NO","NO",null,null,null,null,3.1850591785519182E-2]
["Manhattan","23 St [F, M]",7512297,7565129,7161707,7394628,7911886,517258,7.0000000000000007E-2,42,null,"NO","NO",null,null,null,null,5.3191320843678037E-2]
["Manhattan","23 St [N, R]",5636909,5889298,5736345,5998303,6659479,661176,0.11,61,null,"NO","NO",null,null,null,null,0.18140615716876041]
["Manhattan","28 St [1]",3585713,3680019,3783842,3941656,4093901,152245,3.9E-2,113,null,"NO","YES",null,null,null,null,0.14172578786980441]
["Manhattan","28 St [6]",6593781,6751198,6548905,6621732,6741400,119668,1.7999999999999999E-2,60,null,"NO","NO",null,null,null,null,2.2387610386210885E-2]
["Manhattan","28 St [N, R]",2951768,3011248,2931184,3044555,3297714,253159,8.3000000000000004E-2,142,null,"NO","NO",null,null,null,null,0.11719959021169686]
["Manhattan","3 Av [L]",1733892,1825033,1886833,2060364,2048408,-11956,-6.0000000000000001E-3,227,null,"NO","NO",null,null,null,null,0.18139307407843164]
["Manhattan","33 St [6]",9261797,9483622,8958763,9090245,9220240,129995,1.4E-2,31,null,"NO","NO",null,null,null,null,-4.4869262412035159E-3]
["Manhattan","34 St-Herald Square [B, D, F, M, N, Q, R]",38564625,39040943,36945680,37769752,37731386,-38366,-1E-3,3,null,"NO","NO",null,null,null,null,-2.1606303704496024E-2]
["Manhattan","34 St-Penn Station [1, 2, 3]",27804027,28343889,27196195,26892243,26758623,-133620,-5.0000000000000001E-3,5,null,"NO","NO",null,null,null,null,-3.7599013984556985E-2]
["Manhattan","34 St-Penn Station [A, C, E]",25262174,26013432,24182097,24265016,24751771,486755,0.02,6,null,"NO","NO",null,null,null,null,-2.0204238954256274E-2]
["Manhattan","42 St-Bryant Pk [B, D, F, M, 7]",13575482,14200488,13502111,13979224,14752187,772963,5.5E-2,18,null,"NO","NO",null,null,null,null,8.6678690303592903E-2]
["Manhattan","47-50 Sts-Rockefeller Center [B, D, F, M]",17628737,17477350,15977449,16517856,17466013,948157,5.7000000000000002E-2,13,null,"NO","NO",null,null,null,null,-9.2306102246576139E-3]
["Manhattan","49 St [N, Q, R]",7976466,8106715,7817461,8139011,8121552,-17459,-2E-3,41,null,"NO","NO",null,null,null,null,1.8189258250458286E-2]
["Manhattan","5 Av-53 St [E, M]",7339012,7488443,6636192,6309404,6519696,210292,3.3000000000000002E-2,65,null,"NO","NO",null,null,null,null,-0.11163846032681238]
["Manhattan","5 Av-59 St [N, Q, R]",5589873,5865430,5582248,5770964,5893657,122693,2.1000000000000001E-2,69,null,"NO","NO",null,null,null,null,5.4345420727805446E-2]
["Manhattan","50 St [1]",8227633,8042404,7477965,7465528,7647852,182324,2.4E-2,47,null,"NO","NO",null,null,null,null,-7.0467533007366759E-2]
["Manhattan","50 St [C, E]",5832174,6014215,5543164,5407322,5573587,166265,3.1E-2,75,null,"NO","NO",null,null,null,null,-4.4338011863157716E-2]
["Manhattan","57 St [F]",4473695,4559484,4237742,4510875,4630781,119906,2.7E-2,97,null,"NO","NO",null,null,null,null,3.5113256491557873E-2]
["Manhattan","57 St-7 Av [N, Q, R]",8851888,9132165,8766257,8804794,8613792,-191002,-2.1999999999999999E-2,35,null,"NO","NO",null,null,null,null,-2.6897764635069942E-2]
["Manhattan","59 St-Columbus Circle [A, B, C, D, 1]",20303125,20858197,20418815,20711058,21300892,589834,2.8000000000000001E-2,7,null,"NO","NO",null,null,null,null,4.9143518547021703E-2]
["Manhattan","66 St-Lincoln Center [1]",7165177,7090347,6714696,6783446,7089390,305944,4.4999999999999998E-2,52,null,"NO","NO",null,null,null,null,-1.0577128799469992E-2]
["Manhattan","68 St-Hunter College [6]",10421267,10558351,10311822,10165641,10481234,315593,3.1E-2,30,null,"NO","NO",null,null,null,null,5.754290721080268E-3]
["Manhattan","7 Av [B, D, E]",4274701,4407607,4121196,4136423,4297779,161356,3.9E-2,108,null,"NO","NO",null,null,null,null,5.3987401691954597E-3]
["Manhattan","72 St [1, 2, 3]",11471075,11868122,11924279,12136784,12784301,647517,5.2999999999999999E-2,19,null,"NO","YES",null,null,null,null,0.11448151110510567]
["Manhattan","72 St [B, C]",2567885,2750338,2670067,2760109,2787379,27270,0.01,171,null,"NO","NO",null,null,null,null,8.5476569238887259E-2]
["Manhattan","77 St [6]",10734505,10954760,10762089,10819466,11163007,343541,3.2000000000000001E-2,25,null,"NO","NO",null,null,null,null,3.9918189054828329E-2]
["Manhattan","79 St [1]",5548857,5285382,5148529,5113161,5330857,217696,4.2999999999999997E-2,80,null,"NO","NO",null,null,null,null,-3.9287370353930547E-2]
["Manhattan","8 St-New York University [N, R]",5398289,5469490,5414133,5474109,5779126,305017,5.6000000000000001E-2,70,null,"NO","NO",null,null,null,null,7.0547723547220234E-2]
["Manhattan","81 St-Museum of Natural History [B, C]",3885270,4073856,4034001,4063020,4116976,53956,1.2999999999999999E-2,111,null,"NO","NO",null,null,null,null,5.9637039382076408E-2]
["Manhattan","86 St [1]",6244181,6096820,6040177,5910540,6128225,217685,3.6999999999999998E-2,67,null,"NO","NO",null,null,null,null,-1.8570249645229693E-2]
["Manhattan","86 St [4, 5, 6]",18669644,19432701,18891890,19147021,19425347,278326,1.4999999999999999E-2,9,null,"NO","NO",null,null,null,null,4.0477633103234323E-2]
["Manhattan","86 St [B, C]",3186744,3288494,3139359,3204204,3238616,34412,1.0999999999999999E-2,146,null,"NO","NO",null,null,null,null,1.6277429250670904E-2]
["Manhattan","96 St [1, 2, 3]",11285713,11464868,11019564,11526582,11784341,257759,2.1999999999999999E-2,23,null,"NO","NO",null,null,null,null,4.4182232881520199E-2]
["Manhattan","96 St [6]",7229943,7470326,7391483,7458694,7753114,294420,3.9E-2,45,null,"NO","NO",null,null,null,null,7.2361704649677047E-2]
["Manhattan","96 St [B, C]",2419299,2583733,2559373,2731945,2775904,43959,1.6E-2,173,null,"NO","NO",null,null,null,null,0.14740013532845672]
["Manhattan","Astor Place [6]",5761704,5877128,5522077,5623822,5571077,-52745,-8.9999999999999993E-3,76,null,"NO","NO",null,null,null,null,-3.3085177579410534E-2]
["Manhattan","Bowery [J, Z]",819021,938115,1051028,1044394,991686,-52708,-0.05,354,null,"NO","NO",null,null,null,null,0.21081877021468315]
["Manhattan","Bowling Green [4, 5]",7373350,8149442,7931319,7770956,7793614,22658,3.0000000000000001E-3,43,null,"NO","NO",null,null,null,null,5.6997701180603121E-2]
["Manhattan","Broad St [J, Z]",1764904,1866784,1795906,1636627,1473717,-162910,-0.1,291,null,"NO","NO",null,null,null,null,-0.16498744407627838]
["Manhattan","Broadway-Lafayette St [B, D, F, M, 6]",10292447,10815409,10439953,11062580,11651990,589410,5.2999999999999999E-2,24,null,"NO","NO",null,null,null,null,0.13209132871901114]
["Manhattan","Brooklyn Bridge-City Hall [4, 5, 6, J, Z]",9998832,10696528,10669147,10783128,10681037,-102091,-8.9999999999999993E-3,29,null,"NO","NO",null,null,null,null,6.8228469085189147E-2]
["Manhattan","Canal St [1]",1646809,1730591,1699577,1720337,1785923,65586,3.7999999999999999E-2,255,null,"NO","NO",null,null,null,null,8.4474884458367663E-2]
["Manhattan","Canal St [A, C, E]",5342257,5537713,5331572,5351984,5646937,294953,5.5E-2,73,null,"NO","NO",null,null,null,null,5.7032074645603906E-2]
["Manhattan","Canal St [J, N, Q, R, Z, 6]",15965933,16444588,15970032,16007057,15577018,-430039,-2.7E-2,15,null,"NO","NO",null,null,null,null,-2.435905249007371E-2]
["Manhattan","Cathedral Pkwy-110 St [1]",4225558,4389552,4359005,4220891,4440822,219931,5.1999999999999998E-2,102,null,"NO","NO",null,null,null,null,5.0943331034623118E-2]
["Manhattan","Cathedral Pkwy-110 St [B, C]",1955675,2092340,2038519,2159675,2166542,6867,3.0000000000000001E-3,211,null,"NO","NO",null,null,null,null,0.10782313012131362]
["Manhattan","Central Park North-110 St [2, 3]",2364377,2428811,2537204,2532019,2724841,192822,7.5999999999999998E-2,176,null,"NO","NO",null,null,null,null,0.15245622842719245]
["Manhattan","Chambers St [1, 2, 3]",5240212,5501448,5867390,6273448,6554728,281280,4.4999999999999998E-2,62,null,"NO","YES",null,null,null,null,0.25085168309984407]
["Manhattan","Chambers St [A, C, E, 2, 3]",15824723,15889622,14770515,14760127,15458781,698654,4.7E-2,16,null,"NO","NO",null,null,null,null,-2.3124701772031016E-2]
["Manhattan","Christopher St-Sheridan Sq [1]",3457597,3479120,3482575,3454080,3471186,17106,5.0000000000000001E-3,136,null,"NO","NO",null,null,null,null,3.9301861957885776E-3]
["Manhattan","City Hall [R]",3081719,3205157,2974836,2790204,2627822,-162382,-5.8000000000000003E-2,181,null,"NO","NO",null,null,null,null,-0.14728695250929758]
["Manhattan","Cortlandt St [1]",0,0,0,0,0,"  ","  "," ",null,"NO","NO",null,null,null,null,""]
["Manhattan","Cortlandt St [R]",0,0,125457,1130741,1640638,509897,0.45100000000000001,271,null,"NO","NO",null,null,null,null,""]
["Manhattan","Delancey St [F, J, M, Z]",5833377,6203633,6297228,6745791,7172867,427076,6.3E-2,51,null,"NO","YES",null,null,null,null,0.2296251382346795]
["Manhattan","Dyckman St [1]",2370738,2507617,2406407,2237661,1212678,-1024983,-0.45800000000000002,326,null,"NO","NO",null,null,null,null,-0.48848080218058682]
["Manhattan","Dyckman St [A]",1837484,1697915,1681370,1931287,2326780,395493,0.20499999999999999,199,null,"NO","NO",null,null,null,null,0.26628585609452926]
["Manhattan","East Broadway [F]",4149390,4281913,4042581,4001149,4057707,56558,1.4E-2,114,null,"NO","NO",null,null,null,null,-2.2095536934344566E-2]
["Manhattan","Franklin St [1]",1704179,1740043,1660670,1719780,1777323,57543,3.3000000000000002E-2,256,null,{"$f":"IF(AND(G324<F324,F324<E324,E324<D324,D324<C324),\"YES\",\"NO\")","v":"NO"},{"$f":"IF(AND(G324>F324,F324>E324,E324>D324,D324>C324),\"YES\",\"NO\")","v":"NO"},null,null,null,null,{"$f":"IFERROR((G324-C324)/C324,\"\")","v":4.2920373974799593E-2}]
["Manhattan","Fulton St [A, C, J, Z, 2, 3, 4, 5]",18924944,19813040,18845513,18303963,17971983,-331980,-1.7999999999999999E-2,12,null,"NO","NO",null,null,null,null,-5.0354759306024892E-2]
["Manhattan","Grand Central-42 St [S, 4, 5, 6, 7]",42981811,44600738,42002971,41903210,42795505,892295,2.1000000000000001E-2,2,null,"NO","NO",null,null,null,null,-4.3345311811082135E-3]
["Manhattan","Grand St [B, D]",7562391,7916118,7767488,7746428,7770139,23711,3.0000000000000001E-3,44,null,"NO","NO",null,null,null,null,2.7471205865975457E-2]
["Manhattan","Harlem-148 St [3]",925233,973522,1003481,989568,1101666,112098,0.113,340,null,"NO","NO",null,null,null,null,0.19069034502660412]
["Manhattan","Houston St [1]",3840225,3905755,3910500,3966857,4225089,258232,6.5000000000000002E-2,109,null,"NO","YES",null,null,null,null,0.10021912778548132]
["Manhattan","Inwood-207 St [A]",2537715,2375232,2413925,2747423,3079573,332150,0.121,154,null,"NO","NO",null,null,null,null,0.21352200700236237]
["Manhattan","Lexington Av [N, Q, R, 4, 5, 6]",19296354,20053574,18924005,19553597,20377141,823544,4.2000000000000003E-2,8,null,"NO","NO",null,null,null,null,5.6009907363847075E-2]
["Manhattan","Lexington Av-53 St [E, M, 6]",20523760,20475053,18618358,18025148,18948032,922884,5.0999999999999997E-2,11,null,"NO","NO",null,null,null,null,-7.6775795468276772E-2]
["Manhattan","Lexington Av-63 St [F]",3807931,3951573,3989743,4889704,4722939,-166765,-3.4000000000000002E-2,92,null,"NO","NO",null,null,null,null,0.24029006828117422]
["Manhattan","Marble Hill-225 St [1]",1782958,1907845,1851554,1769012,1476489,-292523,-0.16500000000000001,290,null,"NO","NO",null,null,null,null,-0.17188795249243111]
["Manhattan","Prince St [N, R]",4827910,4971704,4856796,5146546,5603783,457237,8.8999999999999996E-2,74,null,"NO","NO",null,null,null,null,0.16070577123434365]
["Manhattan","Rector St [1]",1992921,2281857,2331905,2366733,2636681,269948,0.114,180,null,"NO","YES",null,null,null,null,0.32302334111587966]
["Manhattan","Rector St [R]",3023850,3051759,2662135,2463933,2413512,-50421,-0.02,190,null,"NO","NO",null,null,null,null,-0.20184136117862989]
["Manhattan","Roosevelt Island [F]",1874023,1929468,1875228,2580003,2114468,-465535,-0.18,220,null,"NO","NO",null,null,null,null,0.12830418836908619]
["Manhattan","South Ferry[1, R]",8211970,8658540,8823138,8807719,9073709,265990,0.03,32,null,"NO","NO",null,null,null,null,0.10493693961375894]
["Manhattan","Spring St [6]",3605195,3735740,3539095,3727534,3887184,159650,4.2999999999999997E-2,120,null,"NO","NO",null,null,null,null,7.8217405715918273E-2]
["Manhattan","Spring St [C, E]",3319086,3399017,3223654,3301437,3589809,288372,8.6999999999999994E-2,131,null,"NO","NO",null,null,null,null,8.1565527377115268E-2]
["Manhattan","Times Sq-42 St [N, Q, R, S, 1, 2, 3, 7, A, C, E]",58506230,60880668,58099313,58422597,60604822,2182225,3.6999999999999998E-2,1,null,"NO","NO",null,null,null,null,3.5869547567840214E-2]
["Manhattan","Wall St [2, 3]",7141634,7210267,7103567,6919577,7016078,96501,1.4E-2,54,null,"NO","NO",null,null,null,null,-1.7580850544847301E-2]
["Manhattan","Wall St [4, 5]",6389005,6554082,6333204,6393591,6526692,133101,2.1000000000000001E-2,64,null,"NO","NO",null,null,null,null,2.1550617036612117E-2]
["Manhattan","West 4 St-Washington Sq [A, B, C, D, E, F, M]",12249863,12587648,12297799,12295023,12506322,211299,1.7000000000000001E-2,20,null,"NO","NO",null,null,null,null,2.0935662709044175E-2]
["Queens","103 St-Corona Plaza [7]",5396217,5893000,5733398,5831332,6095306,263974,4.4999999999999998E-2,68,null,"NO","NO",null,null,null,null,0.12955168407793829]
["Queens","104 St [A]",534166,550019,510620,503835,523212,19377,3.7999999999999999E-2,402,null,"NO","NO",null,null,null,null,-2.0506733861758331E-2]
["Queens","104 St [J, Z]",722113,765115,771323,760419,782115,21696,2.9000000000000001E-2,383,null,"NO","NO",null,null,null,null,8.309225841384936E-2]
["Queens","111 St [7]",3293751,3398514,3417102,3457250,3494533,37283,1.0999999999999999E-2,134,null,"NO","YES",null,null,null,null,6.0958463466121146E-2]
["Queens","111 St [A]",784560,823229,783299,771073,798886,27813,3.5999999999999997E-2,380,null,"NO","NO",null,null,null,null,1.8259916386254717E-2]
["Queens","111 St [J]",766667,788314,790197,781872,805590,23718,0.03,378,null,"NO","NO",null,null,null,null,5.0769108361257233E-2]
["Queens","121 St [J, Z]",569945,618089,651821,663832,694567,30735,4.5999999999999999E-2,391,null,"NO","YES",null,null,null,null,0.21865618612322241]
["Queens","169 St [F]",2477996,2609045,2607968,2679080,2781001,101921,3.7999999999999999E-2,172,null,"NO","NO",null,null,null,null,0.12227824419409877]
["Queens","21 St [G]",300359,315835,333612,319984,364597,44613,0.13900000000000001,412,null,"NO","NO",null,null,null,null,0.21387073468749063]
["Queens","21 St-Queensbridge [F]",2156028,2237998,2354997,2653708,2707275,53567,0.02,177,null,"NO","YES",null,null,null,null,0.25567710623424184]
["Queens","30 Av [N, Q]",4335014,4445528,4311747,4459345,4340888,-118457,-2.7E-2,105,null,"NO","NO",null,null,null,null,1.3550129249870935E-3]
["Queens","33 St-Rawson St [7]",3433896,3584119,3649228,3729133,3707015,-22118,-6.0000000000000001E-3,126,null,"NO","NO",null,null,null,null,7.9536188632387234E-2]
["Queens","36 Av [N, Q]",2297693,2359911,2290524,2354426,2246477,-107949,-4.5999999999999999E-2,205,null,"NO","NO",null,null,null,null,-2.2290184110758053E-2]
["Queens","36 St [M, R]",928673,962391,1060569,1128415,1238985,110570,9.8000000000000004E-2,322,null,"NO","YES",null,null,null,null,0.33414560345783717]
["Queens","39 Av [N, Q]",652674,698572,789295,868691,823763,-44928,-5.1999999999999998E-2,375,null,"NO","NO",null,null,null,null,0.26213546119502235]
["Queens","40 St-Lowery St [7]",3238060,3364462,3276105,3370172,3378636,8464,3.0000000000000001E-3,141,null,"NO","NO",null,null,null,null,4.3413648913238172E-2]
["Queens","46 St [M, R]",3013452,3115423,2911842,2935729,2964965,29236,0.01,162,null,"NO","NO",null,null,null,null,-1.6090184944044239E-2]
["Queens","46 St-Bliss St [7]",4489751,4706888,4643082,4704924,4683092,-21832,-5.0000000000000001E-3,94,null,"NO","NO",null,null,null,null,4.3062744459547976E-2]
["Queens","52 St [7]",2046013,2108716,2050269,2080234,2117202,36968,1.7999999999999999E-2,218,null,"NO","NO",null,null,null,null,3.4794011572751492E-2]
["Queens","63 Dr-Rego Park [M, R]",4666901,4690625,4455069,4660828,4891415,230587,4.9000000000000002E-2,90,null,"NO","NO",null,null,null,null,4.810772716198608E-2]
["Queens","65 St [M, R]",1044744,1088018,1049810,1065702,1098734,33032,3.1E-2,341,null,"NO","NO",null,null,null,null,5.1677731578262234E-2]
["Queens","67 Av [M, R]",2760770,2841420,2791115,2757795,2791494,33699,1.2E-2,170,null,"NO","NO",null,null,null,null,1.1128779289835806E-2]
["Queens","69 St [7]",1603867,1615823,1618011,1696216,1649055,-47161,-2.8000000000000001E-2,270,null,"NO","NO",null,null,null,null,2.8174405982540947E-2]
["Queens","74-Bway [7, E, F, M, R]",15964663,16466572,16049407,16279556,16377496,97940,6.0000000000000001E-3,14,null,"NO","NO",null,null,null,null,2.5859174102203095E-2]
["Queens","75 Av [E, F]",1155358,1141477,1109370,1134336,1171380,37044,3.3000000000000002E-2,329,null,"NO","NO",null,null,null,null,1.3867563127619317E-2]
["Queens","75 St-Elderts Ln [J, Z]",1082548,1138288,1146401,1102869,1128911,26042,2.4E-2,334,null,"NO","NO",null,null,null,null,4.2827662145235132E-2]
["Queens","80 St [A]",1264255,1315559,1267343,1259783,1283827,24044,1.9E-2,315,null,"NO","NO",null,null,null,null,1.54810540595054E-2]
["Queens","82 St-Jackson Hts [7]",5311181,5438796,5227935,5110694,5163208,52514,0.01,84,null,"NO","NO",null,null,null,null,-2.7860658486314062E-2]
["Queens","85 St-Forest Pkwy [J]",1115695,1134066,1117772,1100059,1138842,38783,3.5000000000000003E-2,331,null,"NO","NO",null,null,null,null,2.074670945016335E-2]
["Queens","88 St [A]",768436,812392,786807,790264,805054,14790,1.9E-2,379,null,"NO","NO",null,null,null,null,4.7652634702174283E-2]
["Queens","90 St-Elmhurst Av [7]",5486746,5671029,5456494,5482132,5480782,-1350,0,77,null,"NO","NO",null,null,null,null,-1.0869830679240482E-3]
["Queens","Aqueduct Racetrack [A]",29868,30535,27004,29644,54183,24539,0.82799999999999996,420,null,"NO","NO",null,null,null,null,0.81408196062675775]
["Queens","Aqueduct-North Conduit Av [A]",268999,268814,249341,238119,474915,236796,0.99399999999999999,405,null,"NO","NO",null,null,null,null,0.76548983453470087]
["Queens","Astoria Blvd [N, Q]",3407485,3605708,3532735,3621730,3850546,228816,6.3E-2,122,null,"NO","NO",null,null,null,null,0.13002581082528611]
["Queens","Astoria-Ditmars Blvd [N, Q]",5090254,5276352,5033498,5102415,5203409,100994,0.02,83,null,"NO","NO",null,null,null,null,2.2229735490606167E-2]
["Queens","Beach 105 St [A, S]",78625,86044,58588,65802,80580,14778,0.22500000000000001,419,null,"NO","NO",null,null,null,null,2.4864864864864864E-2]
["Queens","Beach 25 St [A]",519992,554927,502246,388387,501037,112650,0.28999999999999998,404,null,"NO","NO",null,null,null,null,-3.6452483884367455E-2]
["Queens","Beach 36 St [A]",267575,269057,263693,326592,192676,-133916,-0.41,417,null,"NO","NO",null,null,null,null,-0.27991778006166496]
["Queens","Beach 44 St [A]",161583,186281,176647,143788,225250,81462,0.56699999999999995,415,null,"NO","NO",null,null,null,null,0.39402041056299242]
["Queens","Beach 60 St [A]",755916,767363,720544,789468,555937,-233531,-0.29599999999999999,399,null,"NO","NO",null,null,null,null,-0.26455188142597857]
["Queens","Beach 67 St [A]",548672,587384,565130,473942,681006,207064,0.437,392,null,"NO","NO",null,null,null,null,0.24118963606672111]
["Queens","Beach 90 St [A, S]",351425,411581,344465,338595,387012,48417,0.14299999999999999,411,null,"NO","NO",null,null,null,null,0.10126485025254321]
["Queens","Beach 98 St [A, S]",266027,232945,259501,215474,198503,-16971,-7.9000000000000001E-2,416,null,{"$f":"IF(AND(G388<F388,F388<E388,E388<D388,D388<C388),\"YES\",\"NO\")","v":"NO"},{"$f":"IF(AND(G388>F388,F388>E388,E388>D388,D388>C388),\"YES\",\"NO\")","v":"NO"},null,null,null,null,{"$f":"IFERROR((G388-C388)/C388,\"\")","v":-0.25382385998413692}]
["Queens","Briarwood-Van Wyck Blvd [E, F]",1794777,1855107,1764008,1752198,1730276,-21922,-1.2999999999999999E-2,261,null,"NO","NO",null,null,null,null,-3.593816947732225E-2]
["Queens","Broad Channel [A, S]",99178,103573,93087,92523,88837,-3686,-0.04,418,null,"NO","NO",null,null,null,null,-0.10426707535945472]
["Queens","Broadway [N, Q]",4127193,4192433,4012746,4078606,4007018,-71588,-1.7999999999999999E-2,117,null,"NO","NO",null,null,null,null,-2.9117853223728573E-2]
["Queens","Court Sq [E, G, M, 7]",7982397,8530602,7384821,7249807,6334869,-914938,-0.126,66,null,"NO","NO",null,null,null,null,-0.20639514672096615]
["Queens","Elmhurst Av [M, R]",4336533,4468498,4360761,4228036,4338857,110821,2.5999999999999999E-2,106,null,"NO","NO",null,null,null,null,5.3591198314413839E-4]
["Queens","Far Rockaway-Mott Av [A]",1340080,1410829,1337737,1374989,1426835,51846,3.7999999999999999E-2,298,null,"NO","NO",null,null,null,null,6.4738672318070567E-2]
["Queens","Flushing-Main St [7]",17987206,18429212,18287069,18630490,18967751,337261,1.7999999999999999E-2,10,null,"NO","NO",null,null,null,null,5.4513469184708285E-2]
["Queens","Forest Av [M]",1021673,1055248,1068754,1045413,1172881,127468,0.122,328,null,"NO","NO",null,null,null,null,0.14800038759955486]
["Queens","Forest Hills-71 Av [E, F, M, R]",8249613,8407640,8068855,8137277,8316825,179548,2.1999999999999999E-2,38,null,"NO","NO",null,null,null,null,8.1472912729360757E-3]
["Queens","Fresh Pond Rd [M]",1364646,1453096,1450986,1453610,1617252,163642,0.113,274,null,"NO","NO",null,null,null,null,0.18510734652063612]
["Queens","Grand Av-Newtown [M, R]",5549621,5707340,5597743,5564842,5721038,156196,2.8000000000000001E-2,72,null,"NO","NO",null,null,null,null,3.0888055238366727E-2]
["Queens","Howard Beach-JFK Airport [A]",952812,1005669,976481,908576,928529,19953,2.1999999999999999E-2,359,null,"NO","NO",null,null,null,null,-2.5485615210555701E-2]
["Queens","Hunters Point Av [7]",1809854,1799350,1662776,1623490,1655252,31762,0.02,268,null,"NO","NO",null,null,null,null,-8.5422360035671385E-2]
["Queens","Jamaica Center-Parsons-Archer [E, J, Z]",11281412,11738947,11607937,11656110,12147163,491053,4.2000000000000003E-2,22,null,"NO","NO",null,null,null,null,7.6741368899566828E-2]
["Queens","Jamaica-179 St [F]",6692124,6887104,6624050,6711779,6818728,106949,1.6E-2,59,null,"NO","NO",null,null,null,null,1.8918358356778804E-2]
["Queens","Jamaica-Van Wyck [E]",1495426,1366891,1339135,1421186,1527249,106063,7.4999999999999997E-2,285,null,"NO","NO",null,null,null,null,2.1280223829196497E-2]
["Queens","Junction Blvd [7]",6801898,6888532,7054657,7140456,6963489,-176967,-2.5000000000000001E-2,56,null,"NO","NO",null,null,null,null,2.3756751424381842E-2]
["Queens","Kew Gardens-Union Turnpike [E, F]",7865052,8147255,7958721,8170406,8179749,9343,1E-3,39,null,"NO","NO",null,null,null,null,4.0012068578821856E-2]
["Queens","Mets-Willets Point [7]",1863860,2036355,1862720,1856485,1729243,-127242,-6.9000000000000006E-2,262,null,"NO","NO",null,null,null,null,-7.2224845213696307E-2]
["Queens","Middle Village-Metropolitan Av [M]",1023174,1116504,1169385,1124754,1220377,95623,8.5000000000000006E-2,324,null,"NO","NO",null,null,null,null,0.19273652379751635]
["Queens","Northern Blvd [M, R]",2204059,2353366,2250701,2204923,2184353,-20570,-8.9999999999999993E-3,208,null,"NO","NO",null,null,null,null,-8.9407769937193144E-3]
["Queens","Ozone Park-Lefferts Blvd [A]",2256299,2375496,2243456,2221497,2286542,65045,2.9000000000000001E-2,201,null,"NO","NO",null,null,null,null,1.3403808626427614E-2]
["Queens","Parsons Blvd [F]",1840179,1902715,1838982,1903041,1920497,17456,8.9999999999999993E-3,242,null,"NO","NO",null,null,null,null,4.3646840877979806E-2]
["Queens","Queens Plaza [E, M, R]",2431479,2531924,2421042,2408523,2550906,142383,5.8999999999999997E-2,182,null,"NO","NO",null,null,null,null,4.911701890084183E-2]
["Queens","Queensboro Plaza [N, Q, 7]",2704362,2772097,2792245,2813789,3047146,233357,8.3000000000000004E-2,157,null,"NO","YES",null,null,null,null,0.1267522617164418]
["Queens","Rockaway Blvd [A]",2124742,2254731,2254869,2353592,2373967,20375,8.9999999999999993E-3,194,null,"NO","YES",null,null,null,null,0.11729659412766349]
["Queens","Rockaway Park-Beach 116 St [A, S]",284184,293817,267902,268625,286902,18277,6.8000000000000005E-2,413,null,"NO","NO",null,null,null,null,9.5642259944261464E-3]
["Queens","Seneca Av [M]",648147,662730,691907,670795,758144,87349,0.13,385,null,"NO","NO",null,null,null,null,0.16970995777192519]
["Queens","Steinway St [M, R]",4467959,4659675,4547327,4561738,4930914,369176,8.1000000000000003E-2,88,null,"NO","NO",null,null,null,null,0.10361666255218546]
["Queens","Sutphin Blvd [F]",1357689,1399317,1375351,1465324,1470022,4698,3.0000000000000001E-3,293,null,"NO","NO",null,null,null,null,8.2738388541116564E-2]
["Queens","Sutphin Blvd-Archer Av-JFK Airport [E, J, Z]",6064612,6433286,6418547,6447287,6839255,391968,6.0999999999999999E-2,58,null,"NO","NO",null,null,null,null,0.12773166692279736]
["Queens","Vernon Blvd-Jackson Av [7]",2414808,2967358,2939995,3110952,3170128,59176,1.9E-2,149,null,"NO","NO",null,null,null,null,0.31278677228168866]
["Queens","Woodhaven Blvd [J, Z]",1180476,1269407,1285768,1285323,1357800,72477,5.6000000000000001E-2,303,null,"NO","NO",null,null,null,null,0.15021398147865775]
["Queens","Woodhaven Blvd [M, R]",7443133,7695845,7447147,7307038,7241776,-65262,-8.9999999999999993E-3,49,null,"NO","NO",null,null,null,null,-2.7052720944258285E-2]
["Queens","Woodside-61 St [7]",5169510,5517813,5379712,5394103,5382589,-11514,-2E-3,78,null,"NO","NO",null,null,null,null,4.1218413350588352E-2]